{"text_format":"1","workbook":"xlsx","n_sheets":27,"sheets":["EQPT&UTIL","A","B","C","D","E","F","G","H","I","J","K","L","M","N1","N2","O","MODELE","Récap OMS","Récap TOUT","Récap OMS Plus","Suivi Réception","MATRICE 3 SsSco","MATRICE 3 AvSco","MATRICE 2","Statitisques","Feuil1"],"not_rendered":{"charts":0,"images":0,"macros":1,"external_links":0,"defined_names":68,"comments":1,"pivot_tables":0},"unopened":[],"bounds":{"document_bytes":16777216,"sheet_cells":100000,"rows_first":2000,"rows_last":500,"rows_between":2000,"halvings":0,"cell_chars":16384,"cell_head_chars":4096},"cells_cut":0,"cells_raw":0,"read":"whole","date_system":"1900"}

{"sheet":"EQPT&UTIL","index":0,"n_rows":56,"n_cols":24,"rows_kept":56,"cut":false,"hidden":false,"merged":[]}
["ID","EQUIPEMENTS","page",2018,null,"UTILISATEURS","NOMS","Dates","A","B","C","D","E","F","G","H","I","J","K","L","M","N1","N2","O"]
["A","Salle Polyvalente du BOULODROMME",1,"A",null,1,"OMS"]
["B","BOULODROME",2,"B",null,3,"J.B.E."]
["C","Salle Polyvalente  Roger JOURNET",3,"C",null,4,"GYM LOISIR"]
["D","FERNAND FAIVRE - salle 2ème Etage",4,"D",null,5,"BASKET"]
["E","PREAU Ecole du Bourg",5,"E",null,7,"CYCLOS"]
["F","Gymnase Roger JOURNET",6,"F",null,9,"GAULE"]
["G","Gymnase Fernand FAIVRE - Type C",7,"G",null,10,"JUDO"]
["H","Gymnase Fernand FAIVRE - Type B",8,"H",null,11,"LUTTE"]
["I","Salle de Musculation F. Faivre",9,"I",null,14,"T C D"]
["J","Stade  Synthétique Roger JOURNET",10,"J",null,15,"TENNIS  (2)"]
["K","Stade en herbe Roger JOURNET",11,"( M )",null,16,"CIRQUE (1)"]
["L","Stade Charles PIOT",12,"L",null,17,"TAI JITSU"]
["M","Salle de la Tuilerie",13,"( N )",null,19,"G.VOLONTAIRE"]
["N1","Tennis Couverts  court N°1",14,"( O )",null,20,"DIAGONALE"]
["N2","Tennis Couverts  court N°2",15,"( O )",null,21,"A.C.E (1)"]
["O","Salle A.D.C rue du Grand Veymont",16,"P",null,23,"ESCALADE"]
["P","Réserve 0",16,null,null,24,"ARCHERS"]
["Q","Réserve 1",17,null,null,27,"O.C.E"]
["R","Réserve 2",18,null,null,28,"LAI MUOI"]
["S","Réserve 3",19,null,null,30,"TAEKWONDO"]
[null,null,null,null,null,31,"E.S.A.G.A.M.I"]
[null,null,null,null,null,32,"ALEETT"]
[null,"SAISON",null,null,null,34,"SPIRIT 38"]
[null,"2019-2020",null,null,null,35,"GMC38EYBENS"]
[null,null,null,null,null,36,"PETANQUE"]
[null,null,null,null,null,37,"HBC2E"]
[null,null,null,null,null,38,"-"]
[null,null,null,null,null,39,"-"]
[null,null,null,null,null,40,"-"]
[null,null,null,null,null,null,null,null,"A","B","C","D","E","F","G","H","I","J","K","L","M","N1","N2","O"]
[null,null,null,null,null,50,"SCOLAIRE"]
[null,null,null,null,null,51,"Sport Passion"]
[null,null,null,null,null,52,"Péri Scolaire"]
[null,null,null,null,null,53,"Crêche Familiale"]
[null,null,null,null,null,54,"Rel Ass Matern"]
[null,null,null,null,null,55,"?Pôle Enfance"]
[null,null,null,null,null,56,"Anim. Municip."]
[null,null,null,null,null,57,"Crêche P Chose"]
[null,null,null,null,null,58]
[null,null,null,null,null,59,"Police Municip"]
[null,null,null,null,null,60]
[null,null,null,null,null,61,"-"]
[null,null,null,null,null,62,"EN ATTENTE"]
[null,null,null,null,null,100,"POISAT"]
[null,null,null,null,null,101,"ECHIROLLES"]
[null,null,null,null,null,102,"H.P."]
[null,null,null,null,null,103,"I.M.E."]
[null,null,null,null,null,104]
[null,null,null,null,null,105,"Gendarm. Eybens"]
[null,null,null,null,null,106]
[null,null,null,null,null,107,"D.Country"]
[null,null,null,null,null,108,"CE SOPRA"]
[null,null,null,null,null,109,"ASCE"]
[null,null,null,null,null,110,"HARMONIE EYBENS"]
[null,null,null,null,null,111]

{"sheet":"A","index":1,"n_rows":59,"n_cols":26,"rows_kept":59,"cut":false,"hidden":false,"merged":[[59,3,59,15],[0,4,0,18],[0,1,0,3]]}
[{"$f":"INDEX(EQUIPEMENT,MATCH($U$1,ID,0),4)","v":"A"},{"$f":"SAISON","v":"2019-2020"},null,null,{"$f":"INDEX(EQUIPEMENT,MATCH($U$1,ID,0),2)","v":"Salle Polyvalente du BOULODROMME"},null,null,null,null,null,null,null,null,null,null,null,null,null,null,null,"A",null,"Hr","REF","NB 1/4 H","NOMS"]
["09:00:00",null,"LUNDI",null,null,"MARDI",null,null,"MERCREDI",null,null,"JEUDI",null,null,"VENDREDI",null,null,"SAMEDI",null,"Dimanche",null,null,{"$f":"Y2*15/1440","v":0},1,{"$f":"COUNTIF($B$3:$V$56,X2)","v":0},{"$f":"INDEX(UTILISATEURS,MATCH(X2,RefUtil,0),2)","v":"OMS"}]
[{"$f":"+A2+$A$59","v":"09:15:00"},null,19,null,null,53,null,null,103,null,null,54,null,null,19,null,null,10,null,null,null,null,{"$f":"Y3*15/1440","v":0},3,{"$f":"COUNTIF($B$3:$V$56,X3)","v":0},"J.B.E."]
["09:30:00",null,19,null,null,53,null,null,103,null,null,54,null,null,19,null,null,10,null,null,null,null,0.13541666666666666,4,13,{"$f":"INDEX(UTILISATEURS,MATCH(X4,RefUtil,0),2)","v":"GYM LOISIR"}]
["09:45:00",null,19,null,null,53,null,null,103,null,null,54,null,null,19,null,null,10,null,null,null,null,0,5,0,"BASKET"]
["10:00:00",null,19,null,null,53,null,null,103,null,null,54,null,null,19,null,null,10,null,null,null,null,0,7,0,"CYCLOS"]
["10:15:00",null,19,null,null,53,null,null,103,null,null,54,null,null,19,null,null,10,null,null,null,null,0,9,0,"GAULE"]
["10:30:00",null,19,null,null,53,null,null,103,null,null,54,null,null,19,null,null,10,null,null,null,null,0.98958333333333337,10,95,"JUDO"]
["10:45:00",null,19,null,null,53,null,null,103,null,null,54,null,null,19,null,null,10,null,null,null,null,0,11,0,"LUTTE"]
["11:00:00",null,19,null,null,53,null,null,103,null,null,54,null,null,19,null,null,10,null,null,null,null,0,14,{"$f":"COUNTIF($B$3:$V$56,X10)","v":0},{"$f":"INDEX(UTILISATEURS,MATCH(X10,RefUtil,0),2)","v":"T C D"}]
["11:15:00",null,"v",null,null,53,null,null,103,null,null,54,null,null,19,null,null,10,null,null,null,null,0,15,0,"TENNIS  (2)"]
["11:30:00",null,"v",null,null,53,null,null,103,null,null,54,null,null,19,null,null,10,null,null,null,null,0,16,0,"CIRQUE (1)"]
["11:45:00",null,"v",null,null,"v",null,null,"v",null,null,"v",null,null,19,null,null,10,null,null,null,null,0.39583333333333331,17,38,"TAI JITSU"]
["12:00:00",null,"v",null,null,"v",null,null,"v",null,null,"v",null,null,19,null,null,10,null,null,null,null,0.29166666666666669,19,28,"G.VOLONTAIRE"]
["12:15:00",null,"v",null,null,"v",null,null,"v",null,null,"v",null,null,102,null,null,10,null,null,null,null,0,20,0,"DIAGONALE"]
["12:30:00",null,"v",null,null,19,null,null,"v",null,null,4,null,null,102,null,null,10,null,null,null,null,0,21,0,"A.C.E (1)"]
["12:45:00",null,"v",null,null,19,null,null,"v",null,null,4,null,null,102,null,null,10,null,null,null,null,0,23,0,"ESCALADE"]
["13:00:00",null,"v",null,null,19,null,null,"v",null,null,4,null,null,102,null,null,10,null,null,null,null,0,24,0,"ARCHERS"]
["13:15:00",null,"v",null,null,19,null,null,"v",null,null,4,null,null,102,null,null,10,null,null,null,null,0,27,0,"O.C.E"]
["13:30:00",null,"v",null,null,"v",null,null,"v",null,null,null,null,null,4,null,null,10,null,null,null,null,0,28,0,"LAI MUOI"]
["13:45:00",null,103,null,null,"v",null,null,"v",null,null,103,null,null,4,null,null,10,null,null,null,null,0.10416666666666667,30,10,"TAEKWONDO"]
["14:00:00",null,103,null,null,"v",null,null,"v",null,null,103,null,null,4,null,null,10,null,null,null,null,0,31,0,"E.S.A.G.A.M.I"]
["14:15:00",null,103,null,null,"v",null,null,"v",null,null,103,null,null,4,null,null,17,null,null,null,null,0,32,0,"ALEETT"]
["14:30:00",null,103,null,null,"v",null,null,"v",null,null,103,null,null,4,null,null,17,null,null,null,null,0,34,0,"SPIRIT 38"]
["14:45:00",null,103,null,null,"v",null,null,30,null,null,103,null,null,4,null,null,17,null,null,null,null,0,35,0,"GMC38EYBENS"]
["15:00:00",null,103,null,null,"v",null,null,30,null,null,103,null,null,4,null,null,17,null,null,null,null,0,36,0,"PETANQUE"]
["15:15:00",null,103,null,null,"v",null,null,30,null,null,103,null,null,4,null,null,17,null,null,null,null,0,37,0,"HBC2E"]
["15:30:00",null,103,null,null,"v",null,null,30,null,null,103,null,null,4,null,null,17,null,null,null,null,0,38,0,"-"]
["15:45:00",null,103,null,null,"v",null,null,30,null,null,103,null,null,"v",null,null,17,null,null,null,null,0,39,0,"-"]
["16:00:00",null,103,null,null,"v",null,null,30,null,null,103,null,null,"v",null,null,17,null,null,null,null,{"$f":"Y30*15/1440","v":0},50,0,"SCOLAIRE"]
["16:15:00",null,103,null,null,"v",null,null,30,null,null,103,null,null,"v",null,null,17,null,null,null,null,0,51,0,"Sport Passion"]
["16:30:00",null,103,null,null,10,null,null,30,null,null,103,null,null,"v",null,null,17,null,null,null,null,0,52,0,"Péri Scolaire"]
["16:45:00",null,"v",null,null,10,null,null,30,null,null,"v",null,null,"v",null,null,17,null,null,null,null,0.10416666666666667,53,10,"Crêche Familiale"]
["17:00:00",null,10,null,null,10,null,null,30,null,null,10,null,null,"v",null,null,17,null,null,null,null,0.10416666666666667,54,10,{"$f":"INDEX(UTILISATEURS,MATCH(X34,RefUtil,0),2)","v":"Rel Ass Matern"}]
["17:15:00",null,10,null,null,10,null,null,17,null,null,10,null,null,"v",null,null,"v",null,null,null,null,0,55,0,"?Pôle Enfance"]
["17:30:00",null,10,null,null,10,null,null,17,null,null,10,null,null,"v",null,null,"v",null,null,null,null,0,56,0,"Anim. Municip."]
["17:45:00",null,10,null,null,10,null,null,17,null,null,10,null,null,17,null,null,"v",null,null,null,null,0,57,0,"Crêche P Chose"]
["18:00:00",null,10,null,null,10,null,null,17,null,null,10,null,null,17,null,null,"v",null,null,null,null,0,58,0,0]
["18:15:00",null,10,null,null,10,null,null,17,null,null,10,null,null,17,null,null,"v",null,null,null,null,0,59,0,"Police Municip"]
["18:30:00",null,10,null,null,10,null,null,17,null,null,10,null,null,17,null,null,"v",null,null,null,null,0,60,0,0]
["18:45:00",null,10,null,null,10,null,null,17,null,null,10,null,null,17,null,null,"v",null,null,null,null,0,61,0,"-"]
["19:00:00",null,10,null,null,10,null,null,17,null,null,10,null,null,17,null,null,"v",null,null,null,null,0,62,0,"EN ATTENTE"]
["19:15:00",null,10,null,null,10,null,null,17,null,null,10,null,null,10,null,null,"v",null,null,null,null,0,63,0,{"$error":"#N/A"}]
["19:30:00",null,10,null,null,19,null,null,17,null,null,10,null,null,10,null,null,"v",null,null,null,null,0,100,0,"POISAT"]
["19:45:00",null,10,null,null,19,null,null,17,null,null,10,null,null,10,null,null,"v",null,null,null,null,0,101,0,"ECHIROLLES"]
["20:00:00",null,10,null,null,19,null,null,17,null,null,10,null,null,10,null,null,"v",null,null,null,null,5.2083333333333336E-2,102,5,"H.P."]
["20:15:00",null,10,null,null,19,null,null,10,null,null,10,null,null,10,null,null,"v",null,null,null,null,0.35416666666666669,103,34,"I.M.E."]
["20:30:00",null,10,null,null,10,null,null,10,null,null,10,null,null,10,null,null,"v",null,null,null,null,0,104,0,0]
["20:45:00",null,10,null,null,10,null,null,10,null,null,10,null,null,17,null,null,"v",null,null,null,null,0,105,0,"Gendarm. Eybens"]
["21:00:00",null,10,null,null,10,null,null,10,null,null,10,null,null,17,null,null,"v",null,null,null,null,0,106,0,0]
["21:15:00",null,10,null,null,10,null,null,10,null,null,10,null,null,17,null,null,"v",null,null,null,null,0,107,0,"D.Country"]
["21:30:00",null,10,null,null,10,null,null,10,null,null,10,null,null,17,null,null,"v",null,null,null,null,0,108,0,"CE SOPRA"]
["21:45:00",null,10,null,null,10,null,null,"V",null,null,10,null,null,17,null,null,"v",null,null,null,null,0,109,0,"ASCE"]
["22:00:00",null,10,null,null,10,null,null,"V",null,null,10,null,null,17,null,null,"v",null,null,null,null,0,110,0,"HARMONIE EYBENS"]
["22:15:00",null,10,null,null,"V",null,null,"V",null,null,10,null,null,17,null,null,"v",null,null,null,null,0,111,0,0]
["22:30:00",null,null,null,null,"V",null,null,"V",null,null,"V",null,null,17,null,null,"v",null,null,null,null,0,null,0]
[]
[null,null,null,null,null,null,null,null,null,null,null,null,null,null,null,null,null,null,null,null,null,null,{"$f":"Y58*15/1440","v":2.53125},null,{"$f":"SUM(Y2:Y57)","v":243}]
["00:15:00",null,null,null,null,null,null,null,null,null,null,null,null,null,null,null,null,null,"Page N°",{"$f":"VLOOKUP($U$1,EQUIPEMENT,3)","v":1}]

{"sheet":"B","index":2,"n_rows":59,"n_cols":26,"rows_kept":59,"cut":false,"hidden":false,"merged":[[1,19,1,21],[59,3,59,15],[0,4,0,18],[1,1,1,3],[1,4,1,6],[1,7,1,9],[1,10,1,12],[1,13,1,15],[1,16,1,18],[0,1,0,3]]}
[{"$f":"INDEX(EQUIPEMENT,MATCH($U$1,ID,0),4)","v":"B"},{"$f":"SAISON","v":"2019-2020"},null,null,{"$f":"INDEX(EQUIPEMENT,MATCH($U$1,ID,0),2)","v":"BOULODROME"},null,null,null,null,null,null,null,null,null,null,null,null,null,null,null,"B",null,"Hr","REF","NB 1/4 H","NOMS"]
["09:00:00","Lundi",null,null,"Mardi",null,null,"Mercredi",null,null,"Jeudi",null,null,"Vendredi",null,null,"Samedi",null,null,"Dimanche",null,null,{"$f":"Y2*15/1440","v":0},1,{"$f":"COUNTIF($B$3:$V$56,X2)","v":0},{"$f":"INDEX(UTILISATEURS,MATCH(X2,RefUtil,0),2)","v":"OMS"}]
[{"$f":"+A2+$A$59","v":"09:15:00"},null,"v",null,null,"v",null,null,"v",null,null,"v",null,null,"v",null,null,3,null,null,null,null,0.6875,3,{"$f":"COUNTIF($B$3:$V$56,X3)","v":115},"J.B.E."]
["09:30:00",null,"v",null,null,"v",null,null,"v",null,null,"v",null,null,"v",null,null,3,null,null,null,null,0,4,0,"GYM LOISIR"]
["09:45:00",null,"v",null,null,"v",null,null,"v",null,null,"v",null,null,"v",null,null,3,null,null,null,null,0,5,0,"BASKET"]
["10:00:00",null,"v",null,null,"v",null,null,"v",null,null,"v",null,null,"v",null,null,3,null,null,null,null,0,7,0,"CYCLOS"]
["10:15:00",null,"v",null,null,"v",null,null,24,null,null,"v",null,null,"v",null,null,3,null,null,null,null,0,9,0,"GAULE"]
["10:30:00",null,"v",null,null,"v",null,null,24,null,null,"v",null,null,"v",null,null,3,null,null,null,null,0,10,0,"JUDO"]
["10:45:00",null,"v",null,null,"v",null,null,24,null,null,"v",null,null,"v",null,null,3,null,null,null,null,0,11,0,"LUTTE"]
["11:00:00",null,"v",null,null,"v",null,null,24,null,null,"v",null,null,"v",null,null,3,null,null,null,null,0,14,0,"T C D"]
["11:15:00",null,"v",null,null,"v",null,null,24,null,null,"v",null,null,"v",null,null,3,null,null,null,null,0.69791666666666663,15,0,"TENNIS  (2)"]
["11:30:00",null,"v",null,null,"v",null,null,24,null,null,"v",null,null,"v",null,null,3,null,null,null,null,0,16,0,"CIRQUE (1)"]
["11:45:00",null,"v",null,null,"v",null,null,24,null,null,"v",null,null,"v",null,null,3,null,null,null,null,0,17,0,"TAI JITSU"]
["12:00:00",null,"v",null,null,"v",null,null,24,null,null,"v",null,null,"v",null,null,3,null,null,null,null,0,19,0,"G.VOLONTAIRE"]
["12:15:00",null,"v",null,null,"V",null,null,24,null,null,"V",null,null,"v",null,null,null,null,null,null,null,0,20,0,"DIAGONALE"]
["12:30:00",null,"v",null,null,"V",null,null,24,null,null,"V",null,null,"v",null,null,null,null,null,null,null,0,21,0,"A.C.E (1)"]
["12:45:00",null,"v",null,null,"V",null,null,24,null,null,"V",null,null,"v",null,null,null,null,null,null,null,0,23,0,"ESCALADE"]
["13:00:00",null,"v",null,null,"V",null,null,24,null,null,"V",null,null,"v",null,null,null,null,null,null,null,0,24,61,"ARCHERS"]
["13:15:00",null,"v",null,36,null,null,null,24,null,null,null,36,null,"v",null,null,null,null,null,null,null,0,27,0,"O.C.E"]
["13:30:00",null,"v",null,36,null,null,null,24,null,null,null,36,null,"v",null,null,null,null,null,null,null,0,28,0,"LAI MUOI"]
["13:45:00",null,3,103,36,3,null,null,24,null,null,null,36,3,null,null,null,null,null,null,null,null,0.5,30,0,"TAEKWONDO"]
["14:00:00",null,3,103,36,3,null,null,24,null,3,null,36,3,null,null,null,null,null,null,null,null,0,31,22,"E.S.A.G.A.M.I"]
["14:15:00",null,3,103,36,3,null,null,24,null,3,null,36,3,null,null,null,null,null,null,null,null,0,32,0,"ALEETT"]
["14:30:00",null,3,103,36,3,null,null,24,null,3,null,36,3,null,null,null,null,null,null,null,null,0,34,0,"SPIRIT 38"]
["14:45:00",null,3,103,36,3,null,null,24,null,3,null,36,3,null,null,null,null,null,null,null,null,0.1875,35,0,"GMC38EYBENS"]
["15:00:00",null,3,103,36,3,null,null,24,null,3,null,36,3,null,null,null,null,null,null,null,null,0,36,56,"PETANQUE"]
["15:15:00",null,3,103,36,3,null,null,24,null,3,null,36,3,null,null,null,null,null,null,null,null,0,37,0,"HBC2E"]
["15:30:00",null,3,103,36,3,null,null,24,null,3,null,36,3,null,null,null,null,null,null,null,null,0,38,0,"-"]
["15:45:00",null,3,103,36,3,null,null,24,null,3,null,36,3,null,null,null,null,null,null,null,null,0,39,0,"-"]
["16:00:00",null,3,103,36,3,null,null,24,null,3,null,36,3,null,null,null,null,null,null,null,null,0,50,0,"SCOLAIRE"]
["16:15:00",null,3,null,36,3,null,null,24,null,3,null,36,3,null,null,null,null,null,null,null,null,0,51,0,"Sport Passion"]
["16:30:00",null,3,null,36,3,null,null,24,null,3,null,36,3,null,null,null,null,null,null,null,null,0,52,0,"Péri Scolaire"]
["16:45:00",null,3,null,36,3,null,null,24,null,3,null,36,3,null,null,null,null,null,null,null,null,0,53,0,"Crêche Familiale"]
["17:00:00",null,3,null,36,3,null,null,24,null,3,null,36,3,null,null,null,null,null,null,null,null,0,54,null,{"$f":"INDEX(UTILISATEURS,MATCH(X34,RefUtil,0),2)","v":"Rel Ass Matern"}]
["17:15:00",null,3,null,36,3,null,null,24,31,3,null,36,3,null,null,null,null,null,null,null,null,0,55,0,"?Pôle Enfance"]
["17:30:00",null,3,null,36,3,null,null,24,31,3,null,36,3,null,null,null,null,null,null,null,null,0,56,0,"Anim. Municip."]
["17:45:00",null,3,null,36,3,null,null,24,31,3,null,36,3,null,31,null,null,null,null,null,null,0,57,0,"Crêche P Chose"]
["18:00:00",null,3,null,36,3,null,null,24,31,3,null,36,3,null,31,null,null,null,null,null,null,0,58,0,0]
["18:15:00",null,3,null,36,3,null,null,24,31,3,null,36,3,null,31,null,null,null,null,null,null,0,59,0,"Police Municip"]
["18:30:00",null,3,null,36,3,null,null,24,31,3,null,36,3,null,31,null,null,null,null,null,null,0,60,0,0]
["18:45:00",null,3,null,36,3,null,null,24,31,3,null,36,3,null,31,null,null,null,null,null,null,0,61,0,"-"]
["19:00:00",null,3,null,36,3,null,null,24,31,3,null,36,3,null,31,null,null,null,null,null,null,0,62,0,"EN ATTENTE"]
["19:15:00",null,3,null,36,3,null,null,24,31,3,null,36,3,null,31,null,null,null,null,null,null,0,63,0,{"$error":"#N/A"}]
["19:30:00",null,3,null,36,3,null,null,24,31,3,null,36,3,null,31,null,null,null,null,null,null,0,100,0,"POISAT"]
["19:45:00",null,3,null,36,3,null,null,24,31,3,null,36,3,null,31,null,null,null,null,null,null,0,101,0,"ECHIROLLES"]
["20:00:00",null,3,null,36,3,null,null,24,31,3,null,36,3,null,31,null,null,null,null,null,null,0,102,0,"H.P."]
["20:15:00",null,"v",null,24,null,null,null,24,null,24,null,null,null,"V",null,null,null,null,null,null,null,0,103,10,"I.M.E."]
["20:30:00",null,"v",null,24,null,null,null,"v",null,24,null,null,null,"V",null,null,null,null,null,null,null,0,104,0,0]
["20:45:00",null,"v",null,24,null,null,null,"v",null,24,null,null,null,"V",null,null,null,null,null,null,null,0,105,0,"Gendarm. Eybens"]
["21:00:00",null,"v",null,24,null,null,null,"v",null,24,null,null,null,"V",null,null,null,null,null,null,null,0,106,0,0]
["21:15:00",null,"v",null,24,null,null,null,"v",null,24,null,null,null,"v",null,null,null,null,null,null,null,0,107,0,"D.Country"]
["21:30:00",null,"v",null,24,null,null,null,"v",null,24,null,null,null,"v",null,null,null,null,null,null,null,0,108,0,"CE SOPRA"]
["21:45:00",null,"v",null,24,null,null,null,"v",null,24,null,null,null,"v",null,null,null,null,null,null,null,0,109,0,"ASCE"]
["22:00:00",null,"v",null,24,null,null,null,"v",null,24,null,null,null,"v",null,null,null,null,null,null,null,0,110,0,"HARMONIE EYBENS"]
["22:15:00",null,"v",null,24,null,null,null,"v",null,24,null,null,null,"v",null,null,null,null,null,null,null,0,111,0,0]
["22:30:00",null,"v",null,24,null,null,null,"v",null,24,null,null,null,"v"]
[]
[null,null,null,null,null,null,null,null,null,null,null,null,null,null,null,null,null,null,null,null,null,null,{"$f":"Y58*15/1440","v":2.75},null,{"$f":"SUM(Y2:Y57)","v":264}]
["00:15:00",null,null,null,null,null,null,null,null,null,null,null,null,null,null,null,null,null,"Page N°",{"$f":"VLOOKUP($U$1,EQUIPEMENT,3)","v":2}]

{"sheet":"C","index":3,"n_rows":59,"n_cols":26,"rows_kept":59,"cut":false,"hidden":false,"merged":[[1,19,1,21],[59,3,59,15],[0,4,0,18],[1,1,1,3],[1,4,1,6],[1,7,1,9],[1,10,1,12],[1,13,1,15],[1,16,1,18],[0,1,0,3]]}
[{"$f":"INDEX(EQUIPEMENT,MATCH($U$1,ID,0),4)","v":"C"},{"$f":"SAISON","v":"2019-2020"},null,null,{"$f":"INDEX(EQUIPEMENT,MATCH($U$1,ID,0),2)","v":"Salle Polyvalente  Roger JOURNET"},null,null,null,null,null,null,null,null,null,null,null,null,null,null,null,"C",null,"Hr","REF","NB 1/4 H","NOMS"]
["09:00:00","Lundi",null,null,"Mardi",null,null,"Mercredi",null,null,"Jeudi",null,null,"Vendredi",null,null,"Samedi",null,null,"Dimanche",null,null,{"$f":"Y2*15/1440","v":0},1,{"$f":"COUNTIF($B$3:$V$56,X2)","v":0},{"$f":"INDEX(UTILISATEURS,MATCH(X2,RefUtil,0),2)","v":"OMS"}]
[{"$f":"+A2+$A$59","v":"09:15:00"},null,"v",null,null,"v",null,null,19,null,null,"v",null,null,4,null,null,34,null,null,null,null,{"$f":"Y3*15/1440","v":0},3,{"$f":"COUNTIF($B$3:$V$56,X3)","v":0},"J.B.E."]
["09:30:00",null,"v",null,null,"v",null,null,19,null,null,"v",null,null,4,null,null,34,null,null,null,null,0.48958333333333331,4,47,"GYM LOISIR"]
["09:45:00",null,4,null,null,4,null,null,19,null,null,4,null,null,4,null,null,34,null,null,null,null,0,5,0,"BASKET"]
["10:00:00",null,4,null,null,4,null,null,19,null,null,4,null,null,4,null,null,34,null,null,null,null,0,7,0,"CYCLOS"]
["10:15:00",null,4,null,null,4,null,null,19,null,null,4,null,null,4,null,null,34,null,null,null,null,0,9,0,"GAULE"]
["10:30:00",null,4,null,null,4,null,null,19,null,null,4,null,null,4,null,null,34,null,null,null,null,0,10,0,"JUDO"]
["10:45:00",null,4,null,null,4,null,null,19,null,null,4,null,null,4,null,null,34,null,null,null,null,0.16666666666666666,11,16,"LUTTE"]
["11:00:00",null,4,null,null,4,null,null,19,null,null,4,null,null,4,null,null,34,null,null,null,null,0,14,0,"T C D"]
["11:15:00",null,4,null,null,4,null,null,"v",null,null,4,null,null,"v",null,null,34,null,null,null,null,0,15,0,"TENNIS  (2)"]
["11:30:00",null,4,null,null,4,null,null,"v",null,null,4,null,null,"v",null,null,34,null,null,null,null,0,16,0,"CIRQUE (1)"]
["11:45:00",null,"v",null,null,"v",null,null,"v",null,null,"v",null,null,"v",null,null,34,null,null,null,null,0,17,0,"TAI JITSU"]
["12:00:00",null,"v",null,null,"v",null,null,"v",null,null,"v",null,null,"v",null,null,34,null,null,null,null,0.20833333333333334,19,20,"G.VOLONTAIRE"]
["12:15:00",null,102,null,null,"v",null,null,"v",null,null,102,null,null,102,null,null,34,null,null,null,null,0,20,0,"DIAGONALE"]
["12:30:00",null,102,null,null,19,null,null,"v",null,null,102,null,null,102,null,null,34,null,null,null,null,0,21,0,"A.C.E (1)"]
["12:45:00",null,102,null,null,19,null,null,"v",null,null,102,null,null,102,null,null,34,null,null,null,null,0,23,0,"ESCALADE"]
["13:00:00",null,102,null,null,19,null,null,"v",null,null,102,null,null,102,null,null,34,null,null,null,null,0,24,0,"ARCHERS"]
["13:15:00",null,102,null,null,19,null,null,"v",null,null,102,null,null,102,null,null,34,null,null,null,null,0,27,0,"O.C.E"]
["13:30:00",null,102,null,null,null,null,null,"v",null,null,102,null,null,102,null,null,34,null,null,null,null,0.16666666666666666,28,16,"LAI MUOI"]
["13:45:00",null,50,null,null,50,null,null,34,null,null,50,null,null,50,null,null,null,null,null,null,null,0.10416666666666667,30,10,"TAEKWONDO"]
["14:00:00",null,50,null,null,50,null,null,34,null,null,50,null,null,50,null,null,null,null,null,null,null,0,31,0,"E.S.A.G.A.M.I"]
["14:15:00",null,50,null,null,50,null,null,34,null,null,50,null,null,50,null,null,null,null,null,null,null,0,32,0,"ALEETT"]
["14:30:00",null,50,null,null,50,null,null,34,null,null,50,null,null,50,null,null,null,null,null,null,null,0.51041666666666663,34,49,"SPIRIT 38"]
["14:45:00",null,50,null,null,50,null,null,34,null,null,50,null,null,50,null,null,null,null,null,null,null,0,35,0,"GMC38EYBENS"]
["15:00:00",null,50,null,null,50,null,null,34,null,null,50,null,null,50,null,null,null,null,null,null,null,0,36,0,"PETANQUE"]
["15:15:00",null,50,null,null,50,null,null,34,null,null,50,null,null,50,null,null,null,null,null,null,null,0,37,0,"HBC2E"]
["15:30:00",null,50,null,null,50,null,null,34,null,null,50,null,null,50,null,null,null,null,null,null,null,0,38,0,"-"]
["15:45:00",null,50,null,null,50,null,null,34,null,null,50,null,null,50,null,null,null,null,null,null,null,0,39,0,"-"]
["16:00:00",null,50,null,null,50,null,null,34,null,null,50,null,null,50,null,null,null,null,null,null,null,{"$f":"Y30*15/1440","v":0.5},50,48,"SCOLAIRE"]
["16:15:00",null,50,null,null,50,null,null,34,null,null,50,null,null,50,null,null,null,null,null,null,null,0,51,0,"Sport Passion"]
["16:30:00",null,50,null,null,50,null,null,34,null,null,50,null,null,50,null,null,null,null,null,null,null,0,52,0,"Péri Scolaire"]
["16:45:00",null,"v",null,null,"v",null,null,19,null,null,"v",null,null,"v",null,null,null,null,null,null,null,0,53,0,"Crêche Familiale"]
["17:00:00",null,"v",null,null,"v",null,null,19,null,null,"v",null,null,"v",null,null,null,null,null,null,null,0,54,0,{"$f":"INDEX(UTILISATEURS,MATCH(X34,RefUtil,0),2)","v":"Rel Ass Matern"}]
["17:15:00",null,"v",null,null,"v",null,null,19,null,null,"v",null,null,"v",null,null,null,null,null,null,null,0,55,0,"?Pôle Enfance"]
["17:30:00",null,"v",null,null,"v",null,null,19,null,null,"v",null,null,"v",null,null,null,null,null,null,null,0,56,0,"Anim. Municip."]
["17:45:00",null,"v",null,null,11,null,null,"v",null,null,"v",null,null,11,null,null,null,null,null,null,null,0,57,0,"Crêche P Chose"]
["18:00:00",null,"v",null,null,11,null,null,"v",null,null,"v",null,null,11,null,null,null,null,null,null,null,0,58,0,0]
["18:15:00",null,"v",null,null,11,null,null,4,null,null,4,null,null,11,null,null,null,null,null,null,null,0,59,0,"Police Municip"]
["18:30:00",null,"v",null,null,11,null,null,4,null,null,4,null,null,11,null,null,null,null,null,null,null,0,60,0,0]
["18:45:00",null,19,null,null,11,null,null,4,null,null,4,null,null,11,null,null,null,null,null,null,null,0,61,0,"-"]
["19:00:00",null,19,null,null,11,null,null,4,null,null,4,null,null,11,null,null,null,null,null,null,null,0,62,0,"EN ATTENTE"]
["19:15:00",null,19,null,null,11,null,null,4,null,null,28,null,null,11,null,null,null,null,null,null,null,0,63,0,{"$error":"#N/A"}]
["19:30:00",null,19,null,null,11,null,null,4,null,null,28,null,null,11,null,null,null,null,null,null,null,0,100,0,"POISAT"]
["19:45:00",null,34,null,null,28,null,null,4,null,null,28,null,null,30,null,null,null,null,null,null,null,0,101,0,"ECHIROLLES"]
["20:00:00",null,34,null,null,28,null,null,4,null,null,28,null,null,30,null,null,null,null,null,null,null,0.1875,102,18,"H.P."]
["20:15:00",null,34,null,null,28,null,null,4,null,null,28,null,null,30,null,null,null,null,null,null,null,0,103,0,"I.M.E."]
["20:30:00",null,34,null,null,28,null,null,4,null,null,28,null,null,30,null,null,null,null,null,null,null,0,104,0,0]
["20:45:00",null,34,null,null,28,null,null,4,null,null,28,null,null,30,null,null,null,null,null,null,null,0,105,0,"Gendarm. Eybens"]
["21:00:00",null,34,null,null,28,null,null,34,null,null,28,null,null,30,null,null,null,null,null,null,null,0,106,0,0]
["21:15:00",null,34,null,null,28,null,null,34,null,null,"v",null,null,30,null,null,null,null,null,null,null,0,107,0,"D.Country"]
["21:30:00",null,34,null,null,28,null,null,34,null,null,"v",null,null,30,null,null,null,null,null,null,null,0,108,0,"CE SOPRA"]
["21:45:00",null,34,null,null,"v",null,null,34,null,null,"v",null,null,30,null,null,null,null,null,null,null,0,109,0,"ASCE"]
["22:00:00",null,34,null,null,"v",null,null,34,null,null,"v",null,null,30,null,null,null,null,null,null,null,0,110,0,"HARMONIE EYBENS"]
["22:15:00",null,34,null,null,"v",null,null,34,null,null,"v",null,null,"v",null,null,null,null,null,null,null,0,111,0,0]
["22:30:00",null,34,null,null,"v",null,null,34,null,null,"v",null,null,"v"]
[]
[null,null,null,null,null,null,null,null,null,null,null,null,null,null,null,null,null,null,null,null,null,null,{"$f":"Y58*15/1440","v":2.3333333333333335},null,{"$f":"SUM(Y2:Y57)","v":224}]
["00:15:00",null,null,null,null,null,null,null,null,null,null,null,null,null,null,null,null,null,"Page N°",{"$f":"VLOOKUP($U$1,EQUIPEMENT,3)","v":3}]

{"sheet":"D","index":4,"n_rows":59,"n_cols":26,"rows_kept":59,"cut":false,"hidden":false,"merged":[[1,19,1,21],[59,3,59,15],[0,4,0,18],[1,1,1,3],[1,4,1,6],[1,7,1,9],[1,10,1,12],[1,13,1,15],[1,16,1,18],[0,1,0,3]]}
[{"$f":"INDEX(EQUIPEMENT,MATCH($U$1,ID,0),4)","v":"D"},{"$f":"SAISON","v":"2019-2020"},null,null,{"$f":"INDEX(EQUIPEMENT,MATCH($U$1,ID,0),2)","v":"FERNAND FAIVRE - salle 2ème Etage"},null,null,null,null,null,null,null,null,null,null,null,null,null,null,null,"D",null,"Hr","REF","NB 1/4 H","NOMS"]
["09:00:00","Lundi",null,null,"Mardi",null,null,"Mercredi",null,null,"Jeudi",null,null,"Vendredi",null,null,"Samedi",null,null,"Dimanche",null,null,{"$f":"Y2*15/1440","v":0},1,{"$f":"COUNTIF($B$3:$V$56,X2)","v":0},{"$f":"INDEX(UTILISATEURS,MATCH(X2,RefUtil,0),2)","v":"OMS"}]
[{"$f":"+A2+$A$59","v":"09:15:00"},null,"v",null,null,"v",null,null,"v",null,null,59,null,null,"v",null,null,"v",null,null,null,null,{"$f":"Y3*15/1440","v":0},3,{"$f":"COUNTIF($B$3:$V$56,X3)","v":0},"J.B.E."]
["09:30:00",null,"v",null,null,"v",null,null,"v",null,null,59,null,null,"v",null,null,"v",null,null,null,null,0,4,0,"GYM LOISIR"]
["09:45:00",null,"v",null,null,100,null,null,"v",null,null,59,null,null,"v",null,null,"v",null,null,null,null,0,5,0,"BASKET"]
["10:00:00",null,"v",null,null,100,null,null,"v",null,null,59,null,null,"v",null,null,"v",null,null,null,null,0,7,0,"CYCLOS"]
["10:15:00",null,"v",null,null,100,null,null,"v",null,null,59,null,null,"v",null,null,"v",null,null,null,null,0,9,0,"GAULE"]
["10:30:00",null,"v",null,null,100,null,null,"v",null,null,59,null,null,"v",null,null,"v",null,null,null,null,0,10,0,"JUDO"]
["10:45:00",null,"v",null,null,100,null,null,"v",null,null,59,null,null,"v",null,null,"v",null,null,null,null,0,11,0,"LUTTE"]
["11:00:00",null,"v",null,null,100,null,null,"v",null,null,59,null,null,"v",null,null,"v",null,null,null,null,0,14,0,"T C D"]
["11:15:00",null,"v",null,null,"v",null,null,"v",null,null,59,null,null,"v",null,null,"v",null,null,null,null,0,15,0,"TENNIS  (2)"]
["11:30:00",null,"v",null,null,"v",null,null,"v",null,null,59,null,null,"v",null,null,"v",null,null,null,null,0,16,0,"CIRQUE (1)"]
["11:45:00",null,"v",null,null,"v",null,null,"v",null,null,59,null,null,"v",null,null,"v",null,null,null,null,0,17,0,"TAI JITSU"]
["12:00:00",null,"v",null,null,"v",null,null,"v",null,null,59,null,null,"v",null,null,"v",null,null,null,null,0.13541666666666666,19,13,"G.VOLONTAIRE"]
["12:15:00",null,"v",null,null,"v",null,null,"v",null,null,"v",null,null,"v",null,null,"v",null,null,null,null,0,20,0,"DIAGONALE"]
["12:30:00",null,"v",null,null,"v",null,null,"v",null,null,"v",null,null,"v",null,null,"v",null,null,null,null,0,21,0,"A.C.E (1)"]
["12:45:00",null,"v",null,null,"v",null,null,"v",null,null,"v",null,null,"v",null,null,"v",null,null,null,null,0,23,0,"ESCALADE"]
["13:00:00",null,"v",null,null,"v",null,null,"v",null,null,"v",null,null,"v",null,null,"v",null,null,null,null,0,24,0,"ARCHERS"]
["13:15:00",null,"v",null,null,"v",null,null,"v",null,null,"v",null,null,"v",null,null,"v",null,null,null,null,0,27,0,"O.C.E"]
["13:30:00",null,"v",null,null,"v",null,null,"v",null,null,"v",null,null,"v",null,null,"v",null,null,null,null,0,28,0,"LAI MUOI"]
["13:45:00",null,"v",null,null,"v",null,null,"v",null,null,"v",null,null,"v",null,null,"v",null,null,null,null,0.20833333333333334,30,20,"TAEKWONDO"]
["14:00:00",null,"v",null,null,"v",null,null,"v",null,null,"v",null,null,"v",null,null,"v",null,null,null,null,0,31,0,"E.S.A.G.A.M.I"]
["14:15:00",null,"v",null,null,"v",null,null,"v",null,null,"v",null,null,"v",null,null,"v",null,null,null,null,0,32,0,"ALEETT"]
["14:30:00",null,"v",null,null,"v",null,null,"v",null,null,"v",null,null,"v",null,null,"v",null,null,null,null,0,34,0,"SPIRIT 38"]
["14:45:00",null,"v",null,null,"v",null,null,"v",null,null,"v",null,null,"v",null,null,"v",null,null,null,null,0,35,0,"GMC38EYBENS"]
["15:00:00",null,"v",null,null,"v",null,null,"v",null,null,"v",null,null,"v",null,null,"v",null,null,null,null,0,36,0,"PETANQUE"]
["15:15:00",null,"v",null,null,"v",null,null,"v",null,null,"v",null,null,"v",null,null,"v",null,null,null,null,0,37,0,"HBC2E"]
["15:30:00",null,"v",null,null,"v",null,null,"v",null,null,"v",null,null,"v",null,null,"v",null,null,null,null,0,38,0,"-"]
["15:45:00",null,"v",null,null,"v",null,null,"v",null,null,"v",null,null,"v",null,null,"v",null,null,null,null,0,39,0,"-"]
["16:00:00",null,"v",null,null,"v",null,null,"v",null,null,"v",null,null,"v",null,null,"v",null,null,null,null,{"$f":"Y30*15/1440","v":0},50,0,"SCOLAIRE"]
["16:15:00",null,"v",null,null,"v",null,null,"v",null,null,"v",null,null,"v",null,null,"v",null,null,null,null,0,51,0,"Sport Passion"]
["16:30:00",null,"v",null,null,"v",null,null,"v",null,null,"v",null,null,"v",null,null,"v",null,null,null,null,0,52,0,"Péri Scolaire"]
["16:45:00",null,"v",null,null,"v",null,null,"v",null,null,"v",null,null,"v",null,null,"v",null,null,null,null,0,53,0,"Crêche Familiale"]
["17:00:00",null,"v",null,null,"v",null,null,"v",null,null,"v",null,null,"v",null,null,"v",null,null,null,null,0,54,0,{"$f":"INDEX(UTILISATEURS,MATCH(X34,RefUtil,0),2)","v":"Rel Ass Matern"}]
["17:15:00",null,"v",null,null,"v",null,null,"v",null,null,"v",null,null,"v",null,null,"v",null,null,null,null,0,55,0,"?Pôle Enfance"]
["17:30:00",null,"v",null,null,"v",null,null,"v",null,null,"v",null,null,"v",null,null,"v",null,null,null,null,0,56,0,"Anim. Municip."]
["17:45:00",null,"v",null,null,"v",null,null,"v",null,null,"v",null,null,100,null,null,"v",null,null,null,null,0,57,0,"Crêche P Chose"]
["18:00:00",null,"v",null,null,"v",null,null,"v",null,null,"v",null,null,100,null,null,"v",null,null,null,null,0,58,0,0]
["18:15:00",null,"v",null,null,"v",null,null,"v",null,null,19,null,null,100,null,null,"v",null,null,null,null,0.125,59,12,"Police Municip"]
["18:30:00",null,"v",null,null,"v",null,null,"v",null,null,19,null,null,100,null,null,"v",null,null,null,null,0,60,0,0]
["18:45:00",null,30,null,null,19,null,null,"v",null,null,19,null,null,100,null,null,"v",null,null,null,null,0,61,0,"-"]
["19:00:00",null,30,null,null,19,null,null,"v",null,null,19,null,null,100,null,null,"v",null,null,null,null,0,62,0,"EN ATTENTE"]
["19:15:00",null,30,null,null,19,null,null,30,null,null,19,null,null,100,null,null,"v",null,null,null,null,0,63,0,{"$error":"#N/A"}]
["19:30:00",null,30,null,null,19,null,null,30,null,null,19,null,null,100,null,null,"v",null,null,null,null,0.25,100,24,"POISAT"]
["19:45:00",null,30,null,null,"v",null,null,30,null,null,19,null,null,100,null,null,"v",null,null,null,null,0,101,0,"ECHIROLLES"]
["20:00:00",null,30,null,null,"v",null,null,30,null,null,19,null,null,100,null,null,"v",null,null,null,null,0,102,0,"H.P."]
["20:15:00",null,30,null,null,"v",null,null,30,null,null,19,null,null,100,null,null,"v",null,null,null,null,0,103,0,"I.M.E."]
["20:30:00",null,30,null,null,"v",null,null,30,null,null,"v",null,null,100,null,null,"v",null,null,null,null,0,104,0,0]
["20:45:00",null,30,null,null,"v",null,null,30,null,null,"v",null,null,100,null,null,"v",null,null,null,null,0,105,0,"Gendarm. Eybens"]
["21:00:00",null,30,null,null,"v",null,null,30,null,null,"v",null,null,100,null,null,"v",null,null,null,null,0,106,0,0]
["21:15:00",null,30,null,null,"v",null,null,"v",null,null,"v",null,null,100,null,null,"v",null,null,null,null,0,107,0,"D.Country"]
["21:30:00",null,30,null,null,"v",null,null,"v",null,null,"v",null,null,100,null,null,"v",null,null,null,null,0,108,0,"CE SOPRA"]
["21:45:00",null,"v",null,null,"v",null,null,"v",null,null,"v",null,null,100,null,null,"v",null,null,null,null,0,109,0,"ASCE"]
["22:00:00",null,"v",null,null,"v",null,null,"v",null,null,"v",null,null,100,null,null,"v",null,null,null,null,0,110,0,"HARMONIE EYBENS"]
["22:15:00",null,"v",null,null,"v",null,null,"v",null,null,"v",null,null,"v",null,null,"v",null,null,null,null,0,111,0,0]
["22:30:00",null,"v",null,null,"v",null,null,"v",null,null,"v",null,null,"v",null,null,"v"]
[]
[null,null,null,null,null,null,null,null,null,null,null,null,null,null,null,null,null,null,null,null,null,null,{"$f":"Y58*15/1440","v":0.71875},null,{"$f":"SUM(Y2:Y57)","v":69}]
["00:15:00",null,null,null,null,null,null,null,null,null,null,null,null,null,null,null,null,null,"Page N°",{"$f":"VLOOKUP($U$1,EQUIPEMENT,3)","v":4}]

{"sheet":"E","index":5,"n_rows":59,"n_cols":28,"rows_kept":59,"cut":false,"hidden":false,"merged":[[1,19,1,21],[59,3,59,15],[0,4,0,18],[1,1,1,3],[1,4,1,6],[1,7,1,9],[1,10,1,12],[1,13,1,15],[1,16,1,18],[0,1,0,3]]}
[{"$f":"INDEX(EQUIPEMENT,MATCH($U$1,ID,0),4)","v":"E"},{"$f":"SAISON","v":"2019-2020"},null,null,{"$f":"INDEX(EQUIPEMENT,MATCH($U$1,ID,0),2)","v":"PREAU Ecole du Bourg"},null,null,null,null,null,null,null,null,null,null,null,null,null,null,null,"E",null,"Hr","REF","NB 1/4 H","NOMS"]
["09:00:00","Lundi",null,null,"Mardi",null,null,"Mercredi",null,null,"Jeudi",null,null,"Vendredi",null,null,"Samedi",null,null,"Dimanche",null,null,{"$f":"Y2*15/1440","v":0},1,{"$f":"COUNTIF($B$3:$V$56,X2)","v":0},{"$f":"INDEX(UTILISATEURS,MATCH(X2,RefUtil,0),2)","v":"OMS"}]
[{"$f":"+A2+$A$59","v":"09:15:00"},null,50,null,null,50,null,null,"v",null,null,50,null,null,50,null,null,null,null,null,null,null,{"$f":"Y3*15/1440","v":0},3,{"$f":"COUNTIF($B$3:$V$56,X3)","v":0},"J.B.E."]
["09:30:00",null,50,null,null,50,null,null,"v",null,null,50,null,null,50,null,null,null,null,null,null,null,0.22916666666666666,4,22,"GYM LOISIR"]
["09:45:00",null,50,null,null,50,null,null,"v",null,null,50,null,null,50,null,null,null,null,null,null,null,0,5,0,"BASKET"]
["10:00:00",null,50,null,null,50,null,null,"v",null,null,50,null,null,50,null,null,null,null,null,null,null,0,7,0,"CYCLOS"]
["10:15:00",null,50,null,null,50,null,null,"v",null,null,50,null,null,50,null,null,null,null,null,null,null,0,9,0,"GAULE"]
["10:30:00",null,50,null,null,50,null,null,"v",null,null,50,null,null,50,null,null,null,null,null,null,null,0,10,0,"JUDO"]
["10:45:00",null,50,null,null,50,null,null,"v",null,null,50,null,null,50,null,null,null,null,null,null,null,0,11,0,"LUTTE"]
["11:00:00",null,50,null,null,50,null,null,"v",null,null,50,null,null,50,null,null,null,null,null,null,null,0,14,0,"T C D"]
["11:15:00",null,50,null,null,50,null,null,"v",null,null,50,null,null,50,null,null,null,null,null,null,null,0,15,0,"TENNIS  (2)"]
["11:30:00",null,50,null,null,50,null,null,"v",null,null,50,null,null,50,null,null,null,null,null,null,null,0,16,0,"CIRQUE (1)"]
["11:45:00",null,52,null,null,52,null,null,"v",null,null,52,null,null,52,null,null,null,null,null,null,null,0,17,0,"TAI JITSU"]
["12:00:00",null,52,null,null,52,null,null,"v",null,null,52,null,null,52,null,null,null,null,null,null,null,4.1666666666666664E-2,19,4,"G.VOLONTAIRE"]
["12:15:00",null,52,null,null,52,null,null,"v",null,null,52,null,null,52,null,null,null,null,null,null,null,0,20,0,"DIAGONALE"]
["12:30:00",null,52,null,null,52,null,null,"v",null,null,52,null,null,52,null,null,null,null,null,null,null,0,21,0,"A.C.E (1)"]
["12:45:00",null,52,null,null,52,null,null,"v",null,null,52,null,null,52,null,null,null,null,null,null,null,0,23,0,"ESCALADE"]
["13:00:00",null,52,null,null,52,null,null,"v",null,null,52,null,null,52,null,null,null,null,null,null,null,0,24,0,"ARCHERS"]
["13:15:00",null,52,null,null,52,null,null,"v",null,null,52,null,null,52,null,null,null,null,null,null,null,0,27,0,"O.C.E"]
["13:30:00",null,52,null,null,52,null,null,"v",null,null,52,null,null,52,null,null,null,null,null,null,null,0,28,0,"LAI MUOI"]
["13:45:00",null,52,null,null,52,null,null,"v",null,null,52,null,null,52,null,null,null,null,null,null,null,0,30,0,"TAEKWONDO"]
["14:00:00",null,"v",null,null,"v",null,null,"v",null,null,"v",null,null,"v",null,null,null,null,null,null,null,0,31,0,"E.S.A.G.A.M.I"]
["14:15:00",null,50,null,null,50,null,null,"v",null,null,50,null,null,50,null,null,null,null,null,null,null,0,32,0,"ALEETT"]
["14:30:00",null,50,null,null,50,null,null,"v",null,null,50,null,null,50,null,null,null,null,null,null,null,0,34,0,"SPIRIT 38"]
["14:45:00",null,50,null,null,50,null,null,"v",null,null,50,null,null,50,null,null,null,null,null,null,null,0,35,0,"GMC38EYBENS"]
["15:00:00",null,50,null,null,50,null,null,"v",null,null,50,null,null,50,null,null,null,null,null,null,null,0,36,0,"PETANQUE"]
["15:15:00",null,50,null,null,50,null,null,"v",null,null,50,null,null,50,null,null,null,null,null,null,null,0,37,0,"HBC2E"]
["15:30:00",null,50,null,null,50,null,null,"v",null,null,50,null,null,50,null,null,null,null,null,null,null,0,38,0,"-"]
["15:45:00",null,50,null,null,50,null,null,"v",null,null,50,null,null,50,null,null,null,null,null,null,null,0,39,0,"-"]
["16:00:00",null,50,null,null,50,null,null,"v",null,null,50,null,null,52,null,null,null,null,null,null,null,{"$f":"Y30*15/1440","v":0.82291666666666663},50,79,"SCOLAIRE"]
["16:15:00",null,50,null,null,50,null,null,"v",null,null,50,null,null,50,null,null,null,null,null,null,null,0,51,0,"Sport Passion"]
["16:30:00",null,50,null,null,50,null,null,"v",null,null,50,null,null,50,null,null,null,null,null,null,null,0.63541666666666663,52,61,"Péri Scolaire"]
["16:45:00",null,52,null,null,52,null,null,"v",null,null,52,null,null,52,null,null,null,null,null,null,null,0,53,0,"Crêche Familiale"]
["17:00:00",null,52,null,null,52,null,null,"v",null,null,52,null,null,52,null,null,null,null,null,null,null,0,54,0,{"$f":"INDEX(UTILISATEURS,MATCH(X34,RefUtil,0),2)","v":"Rel Ass Matern"}]
["17:15:00",null,52,null,null,52,null,null,"v",null,null,52,null,null,52,null,null,null,null,null,null,null,0,55,0,"?Pôle Enfance"]
["17:30:00",null,52,null,null,52,null,null,"v",null,null,52,null,null,52,null,null,null,null,null,null,null,0,56,0,"Anim. Municip."]
["17:45:00",null,52,null,null,52,null,null,"v",null,null,52,null,null,52,null,null,null,null,null,null,null,0,57,0,"Crêche P Chose"]
["18:00:00",null,52,null,null,52,null,null,"v",null,null,52,null,null,52,null,null,null,null,null,null,null,0,58,0,0]
["18:15:00",null,4,null,null,"v",null,null,4,null,null,"v",null,null,"v",null,null,null,null,null,null,null,0,59,0,"Police Municip"]
["18:30:00",null,4,null,null,"v",null,null,4,null,null,"v",null,null,"v",null,null,null,null,null,null,null,0,60,0,0]
["18:45:00",null,4,null,null,4,null,null,4,null,null,19,null,null,110,null,null,null,null,null,null,null,0,61,0,"-"]
["19:00:00",null,4,null,null,4,null,null,4,null,null,19,null,null,110,null,null,null,null,null,null,null,0,62,0,"EN ATTENTE"]
["19:15:00",null,4,null,null,4,null,null,4,null,null,19,null,null,110,null,null,null,null,null,null,null,0,63,0,{"$error":"#N/A"}]
["19:30:00",null,4,null,null,4,null,null,4,null,null,19,null,null,110,null,null,null,null,null,null,null,0,100,0,"POISAT"]
["19:45:00",null,107,null,null,4,null,null,4,null,null,107,null,null,110,null,null,null,null,null,null,null,0,101,0,"ECHIROLLES"]
["20:00:00",null,107,null,null,4,null,null,4,null,null,107,null,null,110,null,null,null,null,null,null,null,0,102,0,"H.P."]
["20:15:00",null,107,null,null,4,null,null,"v",null,null,107,null,null,110,null,null,null,null,null,null,null,0,103,0,"I.M.E."]
["20:30:00",null,107,null,null,4,null,null,"v",null,null,107,null,null,110,null,null,null,null,null,null,null,0,104,0,0]
["20:45:00",null,107,null,null,"v",null,null,"v",null,null,107,null,null,110,null,null,null,null,null,null,null,0,105,0,"Gendarm. Eybens"]
["21:00:00",null,107,null,null,"v",null,null,"v",null,null,107,null,null,110,null,null,null,null,null,null,null,0,106,0,0,null,"s"]
["21:15:00",null,"v",null,null,"v",null,null,"v",null,null,107,null,null,110,null,null,null,null,null,null,null,0.14583333333333334,107,14,"D.Country"]
["21:30:00",null,"v",null,null,"v",null,null,"v",null,null,107,null,null,110,null,null,null,null,null,null,null,0,108,0,"CE SOPRA"]
["21:45:00",null,"v",null,null,"v",null,null,"v",null,null,"v",null,null,110,null,null,null,null,null,null,null,0,109,0,"ASCE"]
["22:00:00",null,"v",null,null,"v",null,null,"v",null,null,"v",null,null,110,null,null,null,null,null,null,null,0.16666666666666666,110,16,"HARMONIE EYBENS"]
["22:15:00",null,"v",null,null,"v",null,null,"v",null,null,"v",null,null,110,null,null,null,null,null,null,null,0,111,0,0]
["22:30:00",null,"v",null,null,"v",null,null,"v",null,null,"v",null,null,110]
[]
[null,null,null,null,null,null,null,null,null,null,null,null,null,null,null,null,null,null,null,null,null,null,{"$f":"Y58*15/1440","v":2.0416666666666665},null,{"$f":"SUM(Y2:Y57)","v":196}]
["00:15:00",null,null,null,null,null,null,null,null,null,null,null,null,null,null,null,null,null,"Page N°",{"$f":"VLOOKUP($U$1,EQUIPEMENT,3)","v":5}]

{"sheet":"F","index":6,"n_rows":59,"n_cols":26,"rows_kept":59,"cut":false,"hidden":false,"merged":[[1,19,1,21],[59,3,59,15],[0,4,0,18],[1,1,1,3],[1,4,1,6],[1,7,1,9],[1,10,1,12],[1,13,1,15],[1,16,1,18],[0,1,0,3]]}
[{"$f":"INDEX(EQUIPEMENT,MATCH($U$1,ID,0),4)","v":"F"},{"$f":"SAISON","v":"2019-2020"},null,null,{"$f":"INDEX(EQUIPEMENT,MATCH($U$1,ID,0),2)","v":"Gymnase Roger JOURNET"},null,null,null,null,null,null,null,null,null,null,null,null,null,null,null,"F",null,"Hr","REF","NB 1/4 H","NOMS"]
["09:00:00","Lundi",null,null,"Mardi",null,null,"Mercredi",null,null,"Jeudi",null,null,"Vendredi",null,null,"Samedi",null,null,"Dimanche",null,null,{"$f":"Y2*15/1440","v":0},1,{"$f":"COUNTIF($B$3:$V$56,X2)","v":0},{"$f":"INDEX(UTILISATEURS,MATCH(X2,RefUtil,0),2)","v":"OMS"}]
[{"$f":"+A2+$A$59","v":"09:15:00"},null,50,null,null,50,null,null,"v",null,null,50,null,null,50,null,null,"v",null,null,null,null,{"$f":"Y3*15/1440","v":0},3,{"$f":"COUNTIF($B$3:$V$56,X3)","v":0},"J.B.E."]
["09:30:00",null,50,null,null,50,null,null,"v",null,null,50,null,null,50,null,null,"v",null,null,null,null,0,4,0,"GYM LOISIR"]
["09:45:00",null,50,null,null,50,null,null,51,null,null,50,null,null,50,null,null,5,null,null,null,null,6.25E-2,5,6,"BASKET"]
["10:00:00",null,50,null,null,50,null,null,51,null,null,50,null,null,50,null,null,5,null,null,null,null,0,7,0,"CYCLOS"]
["10:15:00",null,50,null,null,50,null,null,51,null,null,50,null,null,50,null,null,5,null,null,null,null,0,9,0,"GAULE"]
["10:30:00",null,50,null,null,50,null,null,51,null,null,50,null,null,50,null,null,5,null,null,null,null,0,10,0,"JUDO"]
["10:45:00",null,50,null,null,50,null,null,51,null,null,50,null,null,50,null,null,5,null,null,null,null,0,11,0,"LUTTE"]
["11:00:00",null,50,null,null,50,null,null,51,null,null,50,null,null,50,null,null,5,null,null,null,null,0,14,0,"T C D"]
["11:15:00",null,50,null,null,50,null,null,51,null,null,50,null,null,50,null,null,37,null,null,null,null,0,15,0,"TENNIS  (2)"]
["11:30:00",null,50,null,null,50,null,null,51,null,null,50,null,null,50,null,null,37,null,null,null,null,0,16,0,"CIRQUE (1)"]
["11:45:00",null,50,null,null,50,null,null,51,null,null,50,null,null,50,null,null,37,null,null,null,null,0,17,0,"TAI JITSU"]
["12:00:00",null,"v",null,null,"v",null,null,51,null,null,"V",null,null,"V",null,null,37,null,null,null,null,0,19,0,"G.VOLONTAIRE"]
["12:15:00",null,"v",null,null,"V",null,null,"v",null,null,"V",null,null,"V",null,null,"V",null,null,null,null,0,20,0,"DIAGONALE"]
["12:30:00",null,"v",null,null,"V",null,null,"V",null,null,"V",null,null,"V",null,null,"V",null,null,null,null,0,21,0,"A.C.E (1)"]
["12:45:00",null,"v",null,null,"V",null,null,"V",null,null,"V",null,null,"V",null,null,"V",null,null,null,null,0,23,0,"ESCALADE"]
["13:00:00",null,"v",null,null,"V",null,null,"V",null,null,"V",null,null,"V",null,null,"V",null,null,null,null,0,24,0,"ARCHERS"]
["13:15:00",null,"v",null,null,"V",null,null,"V",null,null,"V",null,null,"V",null,null,"V",null,null,null,null,0,27,0,"O.C.E"]
["13:30:00",null,"v",null,null,"V",null,null,"V",null,null,"V",null,null,"V",null,null,"V",null,null,null,null,0,28,0,"LAI MUOI"]
["13:45:00",null,"v",null,null,"v",null,null,"v",null,null,"v",null,null,"v",null,null,"V",null,null,null,null,0,30,0,"TAEKWONDO"]
["14:00:00",null,50,null,null,50,null,null,"v",null,null,50,null,null,50,null,null,"V",null,null,null,null,0,31,0,"E.S.A.G.A.M.I"]
["14:15:00",null,50,null,null,50,null,null,37,null,null,50,null,null,50,null,null,"V",null,null,null,null,0,32,0,"ALEETT"]
["14:30:00",null,50,null,null,50,null,null,37,null,null,50,null,null,50,null,null,"V",null,null,null,null,0,34,0,"SPIRIT 38"]
["14:45:00",null,50,null,null,50,null,null,37,null,null,50,null,null,50,null,null,"V",null,null,null,null,0,35,0,"GMC38EYBENS"]
["15:00:00",null,50,null,null,50,null,null,37,null,null,50,null,null,50,null,null,"V",null,null,null,null,0,36,0,"PETANQUE"]
["15:15:00",null,50,null,null,50,null,null,37,null,null,50,null,null,50,null,null,"V",null,null,null,null,1.2291666666666667,37,118,"HBC2E"]
["15:30:00",null,50,null,null,50,null,null,37,null,null,50,null,null,50,null,null,"V",null,null,null,null,0,38,0,"-"]
["15:45:00",null,50,null,null,50,null,null,37,null,null,50,null,null,50,null,null,"V",null,null,null,null,0,39,0,"-"]
["16:00:00",null,50,null,null,50,null,null,37,null,null,50,null,null,50,null,null,"V",null,null,null,null,{"$f":"Y30*15/1440","v":0.91666666666666663},50,88,"SCOLAIRE"]
["16:15:00",null,50,null,null,50,null,null,37,null,null,50,null,null,50,null,null,"V",null,null,null,null,0.10416666666666667,51,10,"Sport Passion"]
["16:30:00",null,50,null,null,50,null,null,37,null,null,50,null,null,50,null,null,"V",null,null,null,null,6.25E-2,52,6,"Péri Scolaire"]
["16:45:00",null,"v",null,null,52,null,null,37,null,null,"v",null,null,37,null,null,"V",null,null,null,null,0,53,0,"Crêche Familiale"]
["17:00:00",null,"v",null,null,52,null,null,37,null,null,"v",null,null,37,null,null,"V",null,null,null,null,0,54,0,{"$f":"INDEX(UTILISATEURS,MATCH(X34,RefUtil,0),2)","v":"Rel Ass Matern"}]
["17:15:00",null,"v",null,null,52,null,null,37,null,null,"v",null,null,37,null,null,"V",null,null,null,null,0,55,0,"?Pôle Enfance"]
["17:30:00",null,"v",null,null,52,null,null,37,null,null,"v",null,null,37,null,null,"V",null,null,null,null,0,56,0,"Anim. Municip."]
["17:45:00",null,37,null,null,52,null,null,37,null,null,37,null,null,37,null,null,"V",null,null,null,null,0,57,0,"Crêche P Chose"]
["18:00:00",null,37,null,null,52,null,null,37,null,null,37,null,null,37,null,null,"V",null,null,null,null,0,58,0,0]
["18:15:00",null,37,null,null,37,null,null,37,null,null,37,null,null,37,null,null,"V",null,null,null,null,0,59,0,"Police Municip"]
["18:30:00",null,37,null,null,37,null,null,37,null,null,37,null,null,37,null,null,"V",null,null,null,null,0,60,0,0]
["18:45:00",null,37,null,null,37,null,null,37,null,null,37,null,null,37,null,null,"V",null,null,null,null,0,61,0,"-"]
["19:00:00",null,37,null,null,37,null,null,37,null,null,37,null,null,37,null,null,"V",null,null,null,null,0,62,0,"EN ATTENTE"]
["19:15:00",null,37,null,null,37,null,null,37,null,null,37,null,null,37,null,null,"V",null,null,null,null,0,63,0,{"$error":"#N/A"}]
["19:30:00",null,37,null,null,37,null,null,37,null,null,37,null,null,37,null,null,"V",null,null,null,null,0,100,0,"POISAT"]
["19:45:00",null,37,null,null,37,null,null,37,null,null,37,null,null,37,null,null,"V",null,null,null,null,0,101,0,"ECHIROLLES"]
["20:00:00",null,37,null,null,37,null,null,37,null,null,37,null,null,37,null,null,"V",null,null,null,null,0,102,0,"H.P."]
["20:15:00",null,37,null,null,37,null,null,37,null,null,37,null,null,37,null,null,"V",null,null,null,null,0,103,0,"I.M.E."]
["20:30:00",null,37,null,null,37,null,null,37,null,null,37,null,null,37,null,null,"V",null,null,null,null,0,104,0,0]
["20:45:00",null,37,null,null,37,null,null,37,null,null,37,null,null,37,null,null,"V",null,null,null,null,0,105,0,"Gendarm. Eybens"]
["21:00:00",null,37,null,null,37,null,null,37,null,null,37,null,null,37,null,null,"V",null,null,null,null,0,106,0,0]
["21:15:00",null,37,null,null,37,null,null,37,null,null,37,null,null,37,null,null,"V",null,null,null,null,0,107,0,"D.Country"]
["21:30:00",null,37,null,null,37,null,null,37,null,null,37,null,null,37,null,null,"V",null,null,null,null,0,108,0,"CE SOPRA"]
["21:45:00",null,37,null,null,37,null,null,37,null,null,37,null,null,37,null,null,"V",null,null,null,null,0,109,0,"ASCE"]
["22:00:00",null,37,null,null,37,null,null,37,null,null,37,null,null,37,null,null,"V",null,null,null,null,0,110,0,"HARMONIE EYBENS"]
["22:15:00",null,37,null,null,37,null,null,"v",null,null,37,null,null,37,null,null,"V",null,null,null,null,0,111,0,0]
["22:30:00",null,37,null,null,37,null,null,"v",null,null,37,null,null,37,null,null,"V"]
[null,null,null,null,null,null,null,null,null,null,null,null,null,null,null,null,null,"V"]
[null,null,null,null,null,null,null,null,null,null,null,null,null,null,null,null,null,null,null,null,null,null,{"$f":"Y58*15/1440","v":2.375},null,{"$f":"SUM(Y2:Y57)","v":228}]
["00:15:00",null,null,null,null,null,null,null,null,null,null,null,null,null,null,null,null,null,"Page N°",{"$f":"VLOOKUP($U$1,EQUIPEMENT,3)","v":6}]

{"sheet":"G","index":7,"n_rows":59,"n_cols":26,"rows_kept":59,"cut":false,"hidden":false,"merged":[[1,19,1,21],[59,3,59,15],[0,4,0,18],[1,1,1,3],[1,4,1,6],[1,7,1,9],[1,10,1,12],[1,13,1,15],[1,16,1,18],[0,1,0,3]]}
[{"$f":"INDEX(EQUIPEMENT,MATCH($U$1,ID,0),4)","v":"G"},{"$f":"SAISON","v":"2019-2020"},null,null,{"$f":"INDEX(EQUIPEMENT,MATCH($U$1,ID,0),2)","v":"Gymnase Fernand FAIVRE - Type C"},null,null,null,null,null,null,null,null,null,null,null,null,null,null,null,"G",null,"Hr","Ref","NB 1/4 H","NOMS"]
["09:00:00","Lundi",null,null,"Mardi",null,null,"Mercredi",null,null,"Jeudi",null,null,"Vendredi",null,null,"Samedi",null,null,"Dimanche",null,null,{"$f":"Y2*15/1440","v":0},1,{"$f":"COUNTIF($B$3:$V$56,X2)","v":0},{"$f":"INDEX(UTILISATEURS,MATCH(X2,RefUtil,0),2)","v":"OMS"}]
[{"$f":"+A2+$A$59","v":"09:15:00"},null,100,null,null,50,null,null,"v",null,null,50,null,null,50,null,31,null,null,null,null,null,{"$f":"Y3*15/1440","v":0},3,{"$f":"COUNTIF($B$3:$V$56,X3)","v":0},"J.B.E."]
["09:30:00",null,100,null,null,50,null,null,"v",null,null,50,null,null,50,null,31,null,null,null,null,null,0,4,0,"GYM LOISIR"]
["09:45:00",null,100,null,null,50,null,null,"v",null,null,50,null,null,50,null,31,null,null,null,null,null,1.1666666666666667,5,112,"BASKET"]
["10:00:00",null,100,null,null,50,null,null,"v",null,null,50,null,null,50,null,31,null,null,null,null,null,0,7,0,"CYCLOS"]
["10:15:00",null,100,null,null,50,null,null,5,null,null,50,null,null,50,null,31,null,null,null,null,null,0,9,0,"GAULE"]
["10:30:00",null,100,null,null,50,null,null,5,null,null,50,null,null,50,null,31,null,null,null,null,null,0,10,0,"JUDO"]
["10:45:00",null,100,null,null,50,null,null,5,null,null,50,null,null,50,null,31,null,null,null,null,null,0,11,0,"LUTTE"]
["11:00:00",null,100,null,null,50,null,null,5,null,null,50,null,null,50,null,31,null,null,null,null,null,0,14,0,"T C D"]
["11:15:00",null,"v",null,null,50,null,null,5,null,null,50,null,null,50,null,31,null,null,null,null,null,0,15,0,"TENNIS  (2)"]
["11:30:00",null,"v",null,null,50,null,null,5,null,null,50,null,null,50,null,31,null,null,null,null,null,0,16,0,"CIRQUE (1)"]
["11:45:00",null,"v",null,null,50,null,null,5,null,null,50,null,null,50,null,31,null,null,null,null,null,0,17,0,"TAI JITSU"]
["12:00:00",null,"V",null,null,"V",null,null,5,null,null,"V",null,null,"V",null,31,null,null,null,null,null,0,19,0,"G.VOLONTAIRE"]
["12:15:00",null,"v",null,null,"v",null,null,"v",null,null,"v",null,null,52,null,31,null,null,null,null,null,0,20,0,"DIAGONALE"]
["12:30:00",null,"v",null,null,"v",null,null,"v",null,null,"v",null,null,52,null,"v",null,null,null,null,null,0,21,0,"A.C.E (1)"]
["12:45:00",null,"v",null,null,"v",null,null,"v",null,null,"v",null,null,52,null,"v",null,null,null,null,null,0,23,0,"ESCALADE"]
["13:00:00",null,"v",null,null,"v",null,null,"v",null,null,"v",null,null,52,null,"v",null,null,null,null,null,0,24,0,"ARCHERS"]
["13:15:00",null,"v",null,null,"v",null,null,5,null,null,"v",null,null,52,null,null,null,null,null,null,null,0,27,0,"O.C.E"]
["13:30:00",null,"v",null,null,"v",null,null,5,null,null,"v",null,null,52,null,null,null,null,null,null,null,0,28,0,"LAI MUOI"]
["13:45:00",null,"v",null,null,50,null,null,5,null,null,50,null,null,50,null,null,null,null,null,null,null,0,30,0,"TAEKWONDO"]
["14:00:00",null,50,null,null,50,null,null,5,null,null,50,null,null,50,null,null,null,null,null,null,null,0.13541666666666666,31,13,"E.S.A.G.A.M.I"]
["14:15:00",null,50,null,null,50,null,null,5,null,null,50,null,null,50,null,null,null,null,null,null,null,0,32,0,"ALEETT"]
["14:30:00",null,50,null,null,50,null,null,5,null,null,50,null,null,50,null,null,null,null,null,null,null,0,34,0,"SPIRIT 38"]
["14:45:00",null,50,null,null,50,null,null,5,null,null,50,null,null,50,null,null,null,null,null,null,null,0,35,0,"GMC38EYBENS"]
["15:00:00",null,50,null,null,50,null,null,5,null,null,50,null,null,50,null,null,null,null,null,null,null,0,36,0,"PETANQUE"]
["15:15:00",null,50,null,null,50,null,null,5,null,null,50,null,null,50,null,null,null,null,null,null,null,0,37,0,"HBC2E"]
["15:30:00",null,50,null,null,50,null,null,5,null,null,50,null,null,50,null,null,null,null,null,null,null,0,38,0,"-"]
["15:45:00",null,50,null,null,50,null,null,5,null,null,50,null,null,50,null,null,null,null,null,null,null,0,39,0,"-"]
["16:00:00",null,50,null,null,50,null,null,5,null,null,50,null,null,50,null,null,null,null,null,null,null,{"$f":"Y30*15/1440","v":0.83333333333333337},50,80,"SCOLAIRE"]
["16:15:00",null,50,null,null,50,null,null,5,null,null,50,null,null,50,null,null,null,null,null,null,null,0,51,0,"Sport Passion"]
["16:30:00",null,50,null,null,50,null,null,5,null,null,50,null,null,50,null,null,null,null,null,null,null,0.125,52,12,"Péri Scolaire"]
["16:45:00",null,100,null,null,"v",null,null,5,null,null,52,null,null,"v",null,null,null,null,null,null,null,0,53,0,"Crêche Familiale"]
["17:00:00",null,100,null,null,"v",null,null,5,null,null,52,null,null,"v",null,null,null,null,null,null,null,0,54,0,{"$f":"INDEX(UTILISATEURS,MATCH(X34,RefUtil,0),2)","v":"Rel Ass Matern"}]
["17:15:00",null,100,null,null,"v",null,null,5,null,null,52,null,null,"v",null,null,null,null,null,null,null,0,55,0,"?Pôle Enfance"]
["17:30:00",null,100,null,null,"v",null,null,5,null,null,52,null,null,"v",null,null,null,null,null,null,null,0,56,0,"Anim. Municip."]
["17:45:00",null,100,null,null,5,null,null,5,null,null,52,null,null,5,null,null,null,null,null,null,null,0,57,0,"Crêche P Chose"]
["18:00:00",null,100,null,null,5,null,null,5,null,null,52,null,null,5,null,null,null,null,null,null,null,0,58,0,0]
["18:15:00",null,100,null,null,5,null,null,5,null,null,5,null,null,5,null,null,null,null,null,null,null,0,59,0,"Police Municip"]
["18:30:00",null,100,null,null,5,null,null,5,null,null,5,null,null,5,null,null,null,null,null,null,null,0,60,0,0]
["18:45:00",null,100,null,null,5,null,null,5,null,null,5,null,null,5,null,null,null,null,null,null,null,0,61,0,"-"]
["19:00:00",null,100,null,null,5,null,null,5,null,null,5,null,null,5,null,null,null,null,null,null,null,0,62,0,"EN ATTENTE"]
["19:15:00",null,100,null,null,5,null,null,5,null,null,5,null,null,5,null,null,null,null,null,null,null,0,63,0,{"$error":"#N/A"}]
["19:30:00",null,100,null,null,5,null,null,5,null,null,5,null,null,5,null,null,null,null,null,null,null,0.25,100,24,"POISAT"]
["19:45:00",null,100,null,null,5,null,null,5,null,null,5,null,null,5,null,null,null,null,null,null,null,0,101,0,"ECHIROLLES"]
["20:00:00",null,100,null,null,5,null,null,5,null,null,5,null,null,5,null,null,null,null,null,null,null,0,102,0,"H.P."]
["20:15:00",null,100,null,null,5,null,null,5,null,null,5,null,null,5,null,null,null,null,null,null,null,0,103,0,"I.M.E."]
["20:30:00",null,100,null,null,5,null,null,5,null,null,5,null,null,5,null,null,null,null,null,null,null,0,104,0,0]
["20:45:00",null,5,null,null,5,null,null,5,null,null,5,null,null,5,null,null,null,null,null,null,null,0,105,0,"Gendarm. Eybens"]
["21:00:00",null,5,null,null,5,null,null,5,null,null,5,null,null,5,null,null,null,null,null,null,null,0,106,0,0]
["21:15:00",null,5,null,null,5,null,null,5,null,null,5,null,null,5,null,null,null,null,null,null,null,0,107,0,"D.Country"]
["21:30:00",null,5,null,null,5,null,null,5,null,null,5,null,null,5,null,null,null,null,null,null,null,0,108,0,"CE SOPRA"]
["21:45:00",null,5,null,null,5,null,null,5,null,null,5,null,null,5,null,null,null,null,null,null,null,0,109,0,"ASCE"]
["22:00:00",null,5,null,null,5,null,null,5,null,null,5,null,null,5,null,null,null,null,null,null,null,0,110,0,"HARMONIE EYBENS"]
["22:15:00",null,5,null,null,5,null,null,5,null,null,5,null,null,5,null,null,null,null,null,null,null,0,111,0,0]
["22:30:00",null,5,null,null,5,null,null,5,null,null,5,null,null,5,null,null,null,null,null,null,null,0,null,0]
[]
[null,null,null,null,null,null,null,null,null,null,null,null,null,null,null,null,null,null,null,null,null,null,{"$f":"Y58*15/1440","v":2.5104166666666665},null,{"$f":"SUM(Y2:Y57)","v":241}]
["00:15:00",null,null,null,null,null,null,null,null,null,null,null,null,null,null,null,null,null,"Page N°",{"$f":"VLOOKUP($U$1,EQUIPEMENT,3)","v":7}]

{"sheet":"H","index":8,"n_rows":59,"n_cols":26,"rows_kept":59,"cut":false,"hidden":false,"merged":[[1,19,1,21],[59,3,59,15],[0,4,0,18],[1,1,1,3],[1,4,1,6],[1,7,1,9],[1,10,1,12],[1,13,1,15],[1,16,1,18],[0,1,0,3]]}
[{"$f":"INDEX(EQUIPEMENT,MATCH($U$1,ID,0),4)","v":"H"},{"$f":"SAISON","v":"2019-2020"},null,null,{"$f":"INDEX(EQUIPEMENT,MATCH($U$1,ID,0),2)","v":"Gymnase Fernand FAIVRE - Type B"},null,null,null,null,null,null,null,null,null,null,null,null,null,null,null,"H",null,"Hr","REF","NB 1/4 H","NOMS"]
["09:00:00","Lundi",null,null,"Mardi",null,null,"Mercredi",null,null,"Jeudi",null,null,"Vendredi",null,null,"Samedi",null,null,"Dimanche",null,null,{"$f":"Y2*15/1440","v":0},1,{"$f":"COUNTIF($B$3:$V$56,X2)","v":0},{"$f":"INDEX(UTILISATEURS,MATCH(X2,RefUtil,0),2)","v":"OMS"}]
[{"$f":"+A2+$A$59","v":"09:15:00"},null,50,null,null,50,null,null,"v",null,null,50,null,null,50,null,null,31,null,null,null,null,{"$f":"Y3*15/1440","v":0},3,{"$f":"COUNTIF($B$3:$V$56,X3)","v":0},"J.B.E."]
["09:30:00",null,50,null,null,50,null,null,"v",null,null,50,null,null,50,null,null,31,null,null,null,null,0.125,4,12,"GYM LOISIR"]
["09:45:00",null,50,null,null,50,null,null,51,null,null,50,null,null,50,null,null,31,null,null,null,null,0.625,5,60,"BASKET"]
["10:00:00",null,50,null,null,50,null,null,51,null,null,50,null,null,50,null,null,31,null,null,null,null,0,7,0,"CYCLOS"]
["10:15:00",null,50,null,null,50,null,null,51,null,null,50,null,null,50,null,null,31,null,null,null,null,0,9,0,"GAULE"]
["10:30:00",null,50,null,null,50,null,null,51,null,null,50,null,null,50,null,null,31,null,null,null,null,0,10,0,"JUDO"]
["10:45:00",null,50,null,null,50,null,null,51,null,null,50,null,null,50,null,null,31,null,null,null,null,0,11,0,"LUTTE"]
["11:00:00",null,50,null,null,50,null,null,51,null,null,50,null,null,50,null,null,31,null,null,null,null,0,14,0,"T C D"]
["11:15:00",null,50,null,null,50,null,null,51,null,null,50,null,null,50,null,null,31,null,null,null,null,0,15,0,"TENNIS  (2)"]
["11:30:00",null,50,null,null,50,null,null,51,null,null,50,null,null,50,null,null,31,null,null,null,null,0,16,0,"CIRQUE (1)"]
["11:45:00",null,50,null,null,50,null,null,51,null,null,50,null,null,50,null,null,31,null,null,null,null,0,17,0,"TAI JITSU"]
["12:00:00",null,"v",null,null,"v",null,null,51,null,null,"v",null,null,50,null,null,31,null,null,null,null,0,19,0,"G.VOLONTAIRE"]
["12:15:00",null,52,null,null,"v",null,null,"v",null,null,52,null,null,59,null,null,31,null,null,null,null,0,20,0,"DIAGONALE"]
["12:30:00",null,52,null,null,4,null,null,"v",null,null,52,null,null,59,null,null,null,null,null,null,null,0,21,0,"A.C.E (1)"]
["12:45:00",null,52,null,null,4,null,null,"v",null,null,52,null,null,59,null,null,null,null,null,null,null,0.58333333333333337,23,56,"ESCALADE"]
["13:00:00",null,52,null,null,4,null,null,"v",null,null,52,null,null,59,null,null,null,null,null,null,null,0,24,0,"ARCHERS"]
["13:15:00",null,52,null,null,4,null,null,5,null,null,52,null,null,59,null,null,null,null,null,null,null,0,27,0,"O.C.E"]
["13:30:00",null,52,null,null,"v",null,null,5,null,null,52,null,null,59,null,null,null,null,null,null,null,0,28,0,"LAI MUOI"]
["13:45:00",null,"v",null,null,"v",null,null,5,null,null,"v",null,null,59,null,null,null,null,null,null,null,0,30,0,"TAEKWONDO"]
["14:00:00",null,50,null,null,50,null,null,5,null,null,50,null,null,50,null,null,null,null,null,null,null,0.13541666666666666,31,13,"E.S.A.G.A.M.I"]
["14:15:00",null,50,null,null,50,null,null,5,null,null,50,null,null,50,null,null,null,null,null,null,null,0.5,32,48,"ALEETT"]
["14:30:00",null,50,null,null,50,null,null,5,null,null,50,null,null,50,null,null,null,null,null,null,null,0,34,0,"SPIRIT 38"]
["14:45:00",null,50,null,null,50,null,null,5,null,null,50,null,null,50,null,null,null,null,null,null,null,0,35,0,"GMC38EYBENS"]
["15:00:00",null,50,null,null,50,null,null,5,null,null,50,null,null,50,null,null,null,null,null,null,null,0,36,0,"PETANQUE"]
["15:15:00",null,50,null,null,50,null,null,5,null,null,50,null,null,50,null,null,null,null,null,null,null,0,37,0,"HBC2E"]
["15:30:00",null,50,null,null,50,null,null,5,null,null,50,null,null,50,null,null,null,null,null,null,null,0,38,0,"-"]
["15:45:00",null,50,null,null,50,null,null,5,null,null,50,null,null,50,null,null,null,null,null,null,null,0,39,0,"-"]
["16:00:00",null,50,null,null,50,null,null,5,null,null,50,null,null,50,null,null,null,null,null,null,null,{"$f":"Y30*15/1440","v":0.92708333333333337},50,89,"SCOLAIRE"]
["16:15:00",null,50,null,null,50,null,null,5,null,null,50,null,null,50,null,null,null,null,null,null,null,0.10416666666666667,51,10,"Sport Passion"]
["16:30:00",null,50,null,null,50,null,null,5,null,null,50,null,null,50,null,null,null,null,null,null,null,0.125,52,12,"Péri Scolaire"]
["16:45:00",null,"v",null,null,"v",null,23,null,null,null,"v",null,null,"v",null,null,null,null,null,null,null,0,53,0,"Crêche Familiale"]
["17:00:00",null,"v",null,null,"v",null,23,null,null,null,"v",null,null,"v",null,null,null,null,null,null,null,0,54,0,{"$f":"INDEX(UTILISATEURS,MATCH(X34,RefUtil,0),2)","v":"Rel Ass Matern"}]
["17:15:00",null,5,null,null,"v",null,23,null,32,null,"v",null,null,"v",null,null,null,null,null,null,null,0,55,0,"?Pôle Enfance"]
["17:30:00",null,5,null,null,"v",null,23,null,32,null,"v",null,null,"v",null,null,null,null,null,null,null,0,56,0,"Anim. Municip."]
["17:45:00",null,5,null,23,null,5,23,null,32,null,5,null,null,"v",32,null,null,null,null,null,null,0,57,0,"Crêche P Chose"]
["18:00:00",null,5,null,23,null,5,23,null,32,null,5,null,null,"v",32,null,null,null,null,null,null,0,58,0,0]
["18:15:00",null,5,null,23,null,5,23,null,32,null,5,null,23,"v",32,null,null,null,null,null,null,7.2916666666666671E-2,59,7,"Police Municip"]
["18:30:00",null,5,null,23,null,5,23,null,32,null,5,null,23,"v",32,null,null,null,null,null,null,0,60,0,0]
["18:45:00",null,null,4,23,null,5,23,null,32,null,5,null,23,"v",32,null,null,null,null,null,null,0,61,0,"-"]
["19:00:00",null,null,4,23,null,5,23,null,32,null,5,null,23,"v",32,null,null,null,null,null,null,0,62,0,"EN ATTENTE"]
["19:15:00",null,null,4,23,null,5,23,null,32,null,5,null,23,"v",32,null,null,null,null,null,null,0,63,0,{"$error":"#N/A"}]
["19:30:00",null,null,4,23,null,5,23,null,32,null,5,null,23,"v",32,null,null,null,null,null,null,0,100,0,"POISAT"]
["19:45:00",null,null,4,null,null,5,23,null,32,null,5,null,23,"v",32,null,null,null,null,null,null,0,101,0,"ECHIROLLES"]
["20:00:00",null,null,4,null,null,5,23,null,32,null,5,null,23,"v",32,null,null,null,null,null,null,0,102,0,"H.P."]
["20:15:00",null,null,4,null,null,5,23,null,32,null,5,null,23,"v",32,null,null,null,null,null,null,0,103,0,"I.M.E."]
["20:30:00",23,null,4,null,null,5,23,null,32,null,5,null,23,"v",32,null,null,null,null,null,null,0,104,0,0]
["20:45:00",23,null,null,null,null,5,23,null,32,null,5,null,23,"v",32,null,null,null,null,null,null,0,105,0,"Gendarm. Eybens"]
["21:00:00",23,null,null,null,null,5,23,null,32,null,5,null,23,"v",32,null,null,null,null,null,null,0,106,0,0]
["21:15:00",23,32,null,null,null,5,23,null,32,null,5,null,23,"v",32,null,null,null,null,null,null,0,107,0,"D.Country"]
["21:30:00",23,32,null,null,null,5,23,null,32,null,5,null,23,"v",32,null,null,null,null,null,null,0,108,0,"CE SOPRA"]
["21:45:00",23,32,null,null,null,5,23,null,32,null,5,null,23,"v",32,null,null,null,null,null,null,0,109,0,"ASCE"]
["22:00:00",23,32,null,null,null,5,23,null,32,null,5,null,23,"v",32,null,null,null,null,null,null,0,110,0,"HARMONIE EYBENS"]
["22:15:00",23,32,null,null,null,5,23,null,32,null,5,null,null,null,32,null,null,null,null,null,null,0,111,0,0]
["22:30:00",null,32,null,null,null,5,23,null,32,null,5,null,null,null,32,null,null,null,null,null,null,0,null,0]
[]
[null,null,null,null,null,null,null,null,null,null,null,null,null,null,null,null,null,null,null,null,null,null,{"$f":"Y58*15/1440","v":3.1979166666666665},null,{"$f":"SUM(Y2:Y57)","v":307}]
["00:15:00",null,null,null,null,null,null,null,null,null,null,null,null,null,null,null,null,null,"Page N°",{"$f":"VLOOKUP($U$1,EQUIPEMENT,3)","v":8}]

{"sheet":"I","index":9,"n_rows":59,"n_cols":26,"rows_kept":59,"cut":false,"hidden":false,"merged":[[1,19,1,21],[59,3,59,15],[0,4,0,18],[1,1,1,3],[1,4,1,6],[1,7,1,9],[1,10,1,12],[1,13,1,15],[1,16,1,18],[0,1,0,3]]}
[{"$f":"INDEX(EQUIPEMENT,MATCH($U$1,ID,0),4)","v":"I"},{"$f":"SAISON","v":"2019-2020"},null,null,{"$f":"INDEX(EQUIPEMENT,MATCH($U$1,ID,0),2)","v":"Salle de Musculation F. Faivre"},null,null,null,null,null,null,null,null,null,null,null,null,null,null,null,"I",null,"Hr","REF","NB 1/4 H","NOMS"]
["09:00:00","Lundi",null,null,"Mardi",null,null,"Mercredi",null,null,"Jeudi",null,null,"Vendredi",null,null,"Samedi",null,null,"Dimanche",null,null,{"$f":"Y2*15/1440","v":0.125},1,{"$f":"COUNTIF($B$3:$V$56,X2)","v":12},{"$f":"INDEX(UTILISATEURS,MATCH(X2,RefUtil,0),2)","v":"OMS"}]
[{"$f":"+A2+$A$59","v":"09:15:00"},null,"v",null,null,"v",null,null,"v",null,null,"v",null,null,"v",null,null,null,null,null,null,null,{"$f":"Y3*15/1440","v":0},3,{"$f":"COUNTIF($B$3:$V$56,X3)","v":0},"J.B.E."]
["09:30:00",null,"v",null,null,"v",null,null,"v",null,null,"v",null,null,"v",null,null,null,null,null,null,null,0,4,0,"GYM LOISIR"]
["09:45:00",null,"v",null,null,"v",null,null,"v",null,null,"v",null,null,"v",null,null,null,null,null,null,null,0.44791666666666669,5,43,"BASKET"]
["10:00:00",null,"v",null,null,"v",null,null,"v",null,null,"v",null,null,"v",null,null,null,null,null,null,null,8.3333333333333329E-2,7,8,"CYCLOS"]
["10:15:00",null,"v",null,null,"v",null,null,"v",null,null,"v",null,null,"v",null,null,null,null,null,null,null,0,9,0,"GAULE"]
["10:30:00",null,"v",null,null,"v",null,null,"v",null,null,"v",null,null,"v",null,null,null,null,null,null,null,0,10,0,"JUDO"]
["10:45:00",null,"v",null,null,"v",null,null,"v",null,null,"v",null,null,"v",null,null,null,null,null,null,null,0,11,0,"LUTTE"]
["11:00:00",null,"v",null,null,"v",null,null,"v",null,null,"v",null,null,"v",null,null,null,null,null,null,null,0,14,0,"T C D"]
["11:15:00",null,"v",null,null,"v",null,null,"v",null,null,"v",null,null,"v",null,null,null,null,null,null,null,0,15,0,"TENNIS  (2)"]
["11:30:00",null,"v",null,null,"v",null,null,"v",null,null,"v",null,null,"v",null,null,null,null,null,null,null,0,16,0,"CIRQUE (1)"]
["11:45:00",null,"v",null,null,"v",null,null,"v",null,null,"v",null,null,"v",null,null,null,null,null,null,null,0,17,0,"TAI JITSU"]
["12:00:00",null,"v",null,null,"v",null,null,"v",null,null,"v",null,null,"v",null,null,null,null,null,null,null,0,19,0,"G.VOLONTAIRE"]
["12:15:00",null,"v",null,null,"v",null,null,"v",null,null,"v",null,null,"v",null,null,null,null,null,null,null,0,20,0,"DIAGONALE"]
["12:30:00",null,"v",null,null,"v",null,null,"v",null,null,"v",null,null,"v",null,null,null,null,null,null,null,0,21,0,"A.C.E (1)"]
["12:45:00",null,"v",null,null,"v",null,null,"v",null,null,"v",null,null,"v",null,null,null,null,null,null,null,0,23,0,"ESCALADE"]
["13:00:00",null,"v",null,null,"v",null,null,"v",null,null,"v",null,null,"v",null,null,null,null,null,null,null,0,24,0,"ARCHERS"]
["13:15:00",null,"v",null,null,"v",null,null,"v",null,null,"v",null,null,"v",null,null,null,null,null,null,null,0,27,0,"O.C.E"]
["13:30:00",null,"v",null,null,"v",null,null,"v",null,null,"v",null,null,"v",null,null,null,null,null,null,null,0,28,0,"LAI MUOI"]
["13:45:00",null,"v",null,null,"v",null,null,"v",null,null,"v",null,null,"v",null,null,null,null,null,null,null,0,30,0,"TAEKWONDO"]
["14:00:00",null,"v",null,null,"v",null,null,"v",null,null,"v",null,null,"v",null,null,null,null,null,null,null,0,31,0,"E.S.A.G.A.M.I"]
["14:15:00",null,"v",null,null,"v",null,null,"v",null,null,"v",null,null,"v",null,null,null,null,null,null,null,0,32,0,"ALEETT"]
["14:30:00",null,"v",null,null,"v",null,null,"v",null,null,"v",null,null,"v",null,null,null,null,null,null,null,0,34,0,"SPIRIT 38"]
["14:45:00",null,"v",null,null,"v",null,null,"v",null,null,"v",null,null,"v",null,null,null,null,null,null,null,0,35,0,"GMC38EYBENS"]
["15:00:00",null,"v",null,null,"v",null,null,"v",null,null,"v",null,null,"v",null,null,null,null,null,null,null,0,36,0,"PETANQUE"]
["15:15:00",null,"v",null,null,"v",null,null,"v",null,null,"v",null,null,"v",null,null,null,null,null,null,null,0,37,0,"HBC2E"]
["15:30:00",null,"v",null,null,"v",null,null,"v",null,null,"v",null,null,"v",null,null,null,null,null,null,null,0,38,0,"-"]
["15:45:00",null,"v",null,null,"v",null,null,"v",null,null,"v",null,null,"v",null,null,null,null,null,null,null,0,39,0,"-"]
["16:00:00",null,"v",null,null,"v",null,null,"v",null,null,"v",null,null,"v",null,null,null,null,null,null,null,{"$f":"Y30*15/1440","v":0},50,0,"SCOLAIRE"]
["16:15:00",null,"v",null,null,"v",null,null,"v",null,null,"v",null,null,"v",null,null,null,null,null,null,null,0,51,0,"Sport Passion"]
["16:30:00",null,"v",null,null,"v",null,null,"v",null,null,"v",null,null,"v",null,null,null,null,null,null,null,0,52,0,"Péri Scolaire"]
["16:45:00",null,"v",null,null,"v",null,null,"v",null,null,"v",null,null,"v",null,null,null,null,null,null,null,0,53,0,"Crêche Familiale"]
["17:00:00",null,"v",null,null,"v",null,null,"v",null,null,"v",null,null,"v",null,null,null,null,null,null,null,0,54,0,{"$f":"INDEX(UTILISATEURS,MATCH(X34,RefUtil,0),2)","v":"Rel Ass Matern"}]
["17:15:00",null,"v",null,null,"v",null,null,56,null,null,7,null,null,56,null,null,null,null,null,null,null,1.0416666666666666E-2,55,1,"?Pôle Enfance"]
["17:30:00",null,"v",null,null,"v",null,null,56,null,null,7,null,null,56,null,null,null,null,null,null,null,0.16666666666666666,56,16,"Anim. Municip."]
["17:45:00",null,"v",null,null,"v",null,null,56,null,null,7,null,null,56,null,null,null,null,null,null,null,0,57,0,"Crêche P Chose"]
["18:00:00",null,"v",null,null,"v",null,null,56,null,null,7,null,null,56,null,null,null,null,null,null,null,0,58,0,0]
["18:15:00",null,"v",null,null,"v",null,null,56,null,null,7,null,null,56,null,null,null,null,null,null,null,0,59,0,"Police Municip"]
["18:30:00",null,"v",null,null,"v",null,null,56,null,null,7,null,null,56,null,null,null,null,null,null,null,0,60,0,0]
["18:45:00",null,1,null,null,5,null,null,56,null,null,7,null,null,56,null,null,null,null,null,null,null,0,61,0,"-"]
["19:00:00",null,1,null,null,5,null,null,56,null,null,7,null,null,56,null,null,null,null,null,null,null,0,62,0,"EN ATTENTE"]
["19:15:00",null,1,null,null,5,null,null,5,null,null,5,null,null,1,null,null,null,null,null,null,null,0,63,0,{"$error":"#N/A"}]
["19:30:00",null,1,null,null,5,null,null,5,null,null,5,null,null,1,null,null,null,null,null,null,null,0,100,0,"POISAT"]
["19:45:00",null,1,null,null,5,null,null,5,null,null,5,null,null,1,null,null,null,null,null,null,null,0,101,0,"ECHIROLLES"]
["20:00:00",null,1,null,null,5,null,null,5,null,null,5,null,null,1,null,null,null,null,null,null,null,0,102,0,"H.P."]
["20:15:00",null,"v",null,null,5,null,null,5,null,null,5,null,null,1,null,null,null,null,null,null,null,0,103,0,"I.M.E."]
["20:30:00",null,"v",null,null,5,null,null,5,null,null,5,null,null,1,null,null,null,null,null,null,null,0,104,0,0]
["20:45:00",null,"v",null,null,5,null,null,5,null,null,5,null,null,"v",null,null,null,null,null,null,null,0,105,0,"Gendarm. Eybens"]
["21:00:00",null,"v",null,null,5,null,null,5,null,null,5,null,null,"v",null,null,null,null,null,null,null,0,106,0,0]
["21:15:00",null,"v",null,null,5,null,null,5,null,null,5,null,null,"v",null,null,null,null,null,null,null,0,107,0,"D.Country"]
["21:30:00",null,"v",null,null,5,null,null,5,null,null,55,null,null,"v",null,null,null,null,null,null,null,0,108,0,"CE SOPRA"]
["21:45:00",null,"v",null,null,5,null,null,5,null,null,5,null,null,"v",null,null,null,null,null,null,null,0,109,0,"ASCE"]
["22:00:00",null,"v",null,null,5,null,null,5,null,null,5,null,null,"v",null,null,null,null,null,null,null,0,110,0,"HARMONIE EYBENS"]
["22:15:00",null,"v",null,null,5,null,null,5,null,null,5,null,null,"v",null,null,null,null,null,null,null,0,111,0,0]
["22:30:00",null,"v",null,null,5,null,null,5,null,null,5,null,null,"v",null,null,null,null,null,null,null,0,71,{"$f":"COUNTIF($B$3:$V$56,X56)","v":0},"schneider electric"]
[]
[null,null,null,null,null,null,null,null,null,null,null,null,null,null,null,null,null,null,null,null,null,null,{"$f":"Y58*15/1440","v":0.83333333333333337},null,{"$f":"SUM(Y2:Y57)","v":80}]
["00:15:00",null,null,null,null,null,null,null,null,null,null,null,null,null,null,null,null,null,"Page N°",{"$f":"VLOOKUP($U$1,EQUIPEMENT,3)","v":9}]

{"sheet":"J","index":10,"n_rows":59,"n_cols":26,"rows_kept":59,"cut":false,"hidden":false,"merged":[[1,19,1,21],[59,3,59,15],[0,4,0,18],[1,1,1,3],[1,4,1,6],[1,7,1,9],[1,10,1,12],[1,13,1,15],[1,16,1,18],[0,1,0,3]]}
[{"$f":"INDEX(EQUIPEMENT,MATCH($U$1,ID,0),4)","v":"J"},{"$f":"SAISON","v":"2019-2020"},null,null,{"$f":"INDEX(EQUIPEMENT,MATCH($U$1,ID,0),2)","v":"Stade  Synthétique Roger JOURNET"},null,null,null,null,null,null,null,null,null,null,null,null,null,null,null,"J",null,"Hr","REF","NB 1/4 H","NOMS"]
["09:00:00","Lundi",null,null,"Mardi",null,null,"Mercredi",null,null,"Jeudi",null,null,"Vendredi",null,null,"Samedi",null,null,"Dimanche",null,null,{"$f":"Y2*15/1440","v":0},1,{"$f":"COUNTIF($B$3:$V$56,X2)","v":0},{"$f":"INDEX(UTILISATEURS,MATCH(X2,RefUtil,0),2)","v":"OMS"}]
[{"$f":"+A2+$A$59","v":"09:15:00"},null,"v",null,null,"v",null,null,"v",null,null,"v",null,null,"v",null,null,null,null,null,null,null,{"$f":"Y3*15/1440","v":0},3,{"$f":"COUNTIF($B$3:$V$56,X3)","v":0},"J.B.E."]
["09:30:00",null,"v",null,null,"v",null,null,"v",null,null,"v",null,null,"v",null,null,null,null,null,null,null,0,4,0,"GYM LOISIR"]
["09:45:00",null,"v",null,null,"v",null,null,"v",null,null,"v",null,null,"v",null,null,null,null,null,null,null,0,5,0,"BASKET"]
["10:00:00",null,"v",null,null,"v",null,null,"v",null,null,"v",null,null,"v",null,null,null,null,null,null,null,0,7,0,"CYCLOS"]
["10:15:00",null,"v",null,null,"v",null,null,"v",null,null,"v",null,null,"v",null,null,27,null,null,null,null,0,9,0,"GAULE"]
["10:30:00",null,"v",null,null,"v",null,null,"v",null,null,"v",null,null,"v",null,null,27,null,null,null,null,0,10,0,"JUDO"]
["10:45:00",null,"v",null,null,"v",null,null,"v",null,null,"v",null,null,"v",null,null,27,null,null,null,null,0,11,0,"LUTTE"]
["11:00:00",null,"v",null,null,"v",null,null,"v",null,null,"v",null,null,"v",null,null,27,null,null,null,null,0,14,0,"T C D"]
["11:15:00",null,"v",null,null,"v",null,null,"v",null,null,"v",null,null,"v",null,null,27,null,null,null,null,0,15,0,"TENNIS  (2)"]
["11:30:00",null,"v",null,null,"v",null,null,"v",null,null,"v",null,null,"v",null,null,27,null,null,null,null,0,16,0,"CIRQUE (1)"]
["11:45:00",null,"v",null,null,"v",null,null,"v",null,null,"v",null,null,"v",null,null,27,null,null,null,null,0,17,0,"TAI JITSU"]
["12:00:00",null,102,null,null,"v",null,null,102,null,null,"v",null,null,102,null,null,27,null,null,null,null,0,19,0,"G.VOLONTAIRE"]
["12:15:00",null,102,null,null,108,null,null,102,null,null,"v",null,null,102,null,null,null,null,null,null,null,0,20,0,"DIAGONALE"]
["12:30:00",null,102,null,null,108,null,null,102,null,null,"v",null,null,102,null,null,null,null,null,null,null,0,21,0,"A.C.E (1)"]
["12:45:00",null,102,null,null,108,null,null,102,null,null,"v",null,null,102,null,null,null,null,null,null,null,0,23,0,"ESCALADE"]
["13:00:00",null,102,null,null,108,null,null,102,null,null,"v",null,null,102,null,null,null,null,null,null,null,0,24,0,"ARCHERS"]
["13:15:00",null,102,null,null,108,null,null,102,null,null,"v",null,null,102,null,null,null,null,null,null,null,1.1770833333333333,27,113,"O.C.E"]
["13:30:00",null,102,null,null,108,null,null,102,null,null,"v",null,null,102,null,null,null,null,null,null,null,0,28,0,"LAI MUOI"]
["13:45:00",null,"v",null,null,108,null,null,27,null,null,"v",null,null,"v",null,null,null,null,null,null,null,0,30,0,"TAEKWONDO"]
["14:00:00",null,"v",null,null,108,null,null,27,null,null,"v",null,null,"v",null,null,null,null,null,null,null,0,31,0,"E.S.A.G.A.M.I"]
["14:15:00",null,"v",null,null,"v",null,null,27,null,null,"v",null,null,"v",null,null,null,null,null,null,null,0,32,0,"ALEETT"]
["14:30:00",null,"v",null,null,"v",null,null,27,null,null,"v",null,null,"v",null,null,null,null,null,null,null,0,34,0,"SPIRIT 38"]
["14:45:00",null,"v",null,null,"v",null,null,27,null,null,"v",null,null,"v",null,null,null,null,null,null,null,0,35,0,"GMC38EYBENS"]
["15:00:00",null,"v",null,null,"v",null,null,27,null,null,"v",null,null,"v",null,null,null,null,null,null,null,0,36,0,"PETANQUE"]
["15:15:00",null,"v",null,null,"v",null,null,27,null,null,"v",null,null,"v",null,null,null,null,null,null,null,0,37,0,"HBC2E"]
["15:30:00",null,"v",null,null,"v",null,null,27,null,null,"v",null,null,"v",null,null,null,null,null,null,null,0,38,0,"-"]
["15:45:00",null,"v",null,null,"v",null,null,27,null,null,"v",null,null,"v",null,null,null,null,null,null,null,0,39,0,"-"]
["16:00:00",null,"v",null,null,"v",null,null,27,null,null,"v",null,null,"v",null,null,null,null,null,null,null,{"$f":"Y30*15/1440","v":0},50,0,"SCOLAIRE"]
["16:15:00",null,"v",null,null,"v",null,null,27,null,null,"v",null,null,"v",null,null,null,null,null,null,null,0,51,0,"Sport Passion"]
["16:30:00",null,"v",null,null,27,null,null,27,null,null,"v",null,null,"v",null,null,null,null,null,null,null,0,52,0,"Péri Scolaire"]
["16:45:00",null,"v",null,null,27,null,null,27,null,null,"v",null,null,27,null,null,null,null,null,null,null,0,53,0,"Crêche Familiale"]
["17:00:00",null,"v",null,null,27,null,null,27,null,null,"v",null,null,27,null,null,null,null,null,null,null,0,54,0,{"$f":"INDEX(UTILISATEURS,MATCH(X34,RefUtil,0),2)","v":"Rel Ass Matern"}]
["17:15:00",null,27,null,null,27,null,null,27,null,null,"v",null,null,27,null,null,null,null,null,null,null,0,55,0,"?Pôle Enfance"]
["17:30:00",null,27,null,null,27,null,null,27,null,null,"v",null,null,27,null,null,null,null,null,null,null,0,56,0,"Anim. Municip."]
["17:45:00",null,27,null,null,27,null,null,27,null,null,"v",null,null,27,null,null,null,null,null,null,null,0,57,0,"Crêche P Chose"]
["18:00:00",null,27,null,null,27,null,null,27,null,null,"v",null,null,27,null,null,null,null,null,null,null,0,58,0,0]
["18:15:00",null,27,null,null,27,null,null,27,null,null,"v",null,null,27,null,null,null,null,null,null,null,0,59,0,"Police Municip"]
["18:30:00",null,27,null,null,27,null,null,27,null,null,"v",null,null,27,null,null,null,null,null,null,null,0,60,0,0]
["18:45:00",null,27,null,null,27,null,null,27,null,null,27,null,null,27,null,null,null,null,null,null,null,0,61,0,"-"]
["19:00:00",null,27,null,null,27,null,null,27,null,null,27,null,null,27,null,null,null,null,null,null,null,0,62,0,"EN ATTENTE"]
["19:15:00",null,27,null,null,27,null,null,27,null,null,27,null,null,27,null,null,null,null,null,null,null,0,63,0,{"$error":"#N/A"}]
["19:30:00",null,27,null,null,27,null,null,27,null,null,27,null,null,27,null,null,null,null,null,null,null,0,100,0,"POISAT"]
["19:45:00",null,27,null,null,27,null,null,27,null,null,27,null,null,27,null,null,null,null,null,null,null,0,101,0,"ECHIROLLES"]
["20:00:00",null,27,null,null,27,null,null,27,null,null,27,null,null,27,null,null,null,null,null,null,null,0.21875,102,21,"H.P."]
["20:15:00",null,27,null,null,27,null,null,27,null,null,27,null,null,27,null,null,null,null,null,null,null,0,103,0,"I.M.E."]
["20:30:00",null,27,null,null,27,null,null,27,null,null,27,null,null,27,null,null,null,null,null,null,null,0,104,0,0]
["20:45:00",null,27,109,null,27,null,null,27,null,null,27,null,null,27,null,null,null,null,null,null,null,0,105,0,"Gendarm. Eybens"]
["21:00:00",null,27,109,null,27,null,null,27,null,null,27,null,null,27,null,null,null,null,null,null,null,0,106,0,0]
["21:15:00",null,27,109,null,"v",null,null,"v",null,null,27,null,null,27,null,null,null,null,null,null,null,0,107,0,"D.Country"]
["21:30:00",null,27,109,null,"v",null,null,"v",null,null,27,null,null,27,null,null,null,null,null,null,null,8.3333333333333329E-2,108,8,"CE SOPRA"]
["21:45:00",null,27,109,null,"v",null,null,"v",null,null,"v",null,null,27,null,null,null,null,null,null,null,6.25E-2,109,6,"ASCE"]
["22:00:00",null,27,109,null,"v",null,null,"v",null,null,"v",null,null,27,null,null,null,null,null,null,null,0,110,0,"HARMONIE EYBENS"]
["22:15:00",null,"v",null,null,"v",null,null,"v",null,null,"v",null,null,27,null,null,null,null,null,null,null,0,111,0,0]
["22:30:00",null,"v",null,null,"v",null,null,"v",null,null,"v",null,null,27,null,null,null,null,null,null,null,0,null,0]
[]
[null,null,null,null,null,null,null,null,null,null,null,null,null,null,null,null,null,null,null,null,null,null,{"$f":"Y58*15/1440","v":1.5416666666666667},null,{"$f":"SUM(Y2:Y57)","v":148}]
["00:15:00",null,null,null,null,null,null,null,null,null,null,null,null,null,null,null,null,null,"Page N°",{"$f":"VLOOKUP($U$1,EQUIPEMENT,3)","v":10}]

{"sheet":"K","index":11,"n_rows":59,"n_cols":26,"rows_kept":59,"cut":false,"hidden":false,"merged":[[1,19,1,21],[59,3,59,15],[0,4,0,18],[1,1,1,3],[1,4,1,6],[1,7,1,9],[1,10,1,12],[1,13,1,15],[1,16,1,18],[0,1,0,3]]}
[{"$f":"INDEX(EQUIPEMENT,MATCH($U$1,ID,0),4)","v":"( M )"},{"$f":"SAISON","v":"2019-2020"},null,null,{"$f":"INDEX(EQUIPEMENT,MATCH($U$1,ID,0),2)","v":"Stade en herbe Roger JOURNET"},null,null,null,null,null,null,null,null,null,null,null,null,null,null,null,"K",null,"Hr","REF","NB 1/4 H","NOMS"]
["09:00:00","Lundi",null,null,"Mardi",null,null,"Mercredi",null,null,"Jeudi",null,null,"Vendredi",null,null,"Samedi",null,null,"Dimanche",null,null,{"$f":"Y2*15/1440","v":0},1,{"$f":"COUNTIF($B$3:$V$56,X2)","v":0},{"$f":"INDEX(UTILISATEURS,MATCH(X2,RefUtil,0),2)","v":"OMS"}]
[{"$f":"+A2+$A$59","v":"09:15:00"},null,null,null,null,null,null,null,null,null,null,null,null,null,null,null,null,null,null,null,null,null,{"$f":"Y3*15/1440","v":0},3,{"$f":"COUNTIF($B$3:$V$56,X3)","v":0},"J.B.E."]
["09:30:00",null,null,null,null,null,null,null,null,null,null,null,null,null,null,null,null,null,null,null,null,null,0,4,0,"GYM LOISIR"]
["09:45:00",null,null,null,null,null,null,null,null,null,null,null,null,null,null,null,null,null,null,null,null,null,0,5,0,"BASKET"]
["10:00:00",null,null,null,null,null,null,null,null,null,null,null,null,null,null,null,null,null,null,null,null,null,0,7,0,"CYCLOS"]
["10:15:00",null,null,null,null,null,null,null,null,null,null,null,null,null,null,null,null,null,null,null,null,null,0,9,0,"GAULE"]
["10:30:00",null,null,null,null,null,null,null,null,null,null,null,null,null,null,null,null,null,null,null,null,null,0,10,0,"JUDO"]
["10:45:00",null,null,null,null,null,null,null,null,null,null,null,null,null,null,null,null,null,null,null,null,null,0,11,0,"LUTTE"]
["11:00:00",null,null,null,null,null,null,null,null,null,null,null,null,null,null,null,null,null,null,null,null,null,0,14,0,"T C D"]
["11:15:00",null,null,null,null,null,null,null,null,null,null,null,null,null,null,null,null,null,null,null,null,null,0,15,0,"TENNIS  (2)"]
["11:30:00",null,null,null,null,null,null,null,null,null,null,null,null,null,null,null,null,null,null,null,null,null,0,16,0,"CIRQUE (1)"]
["11:45:00",null,null,null,null,null,null,null,null,null,null,null,null,null,null,null,null,null,null,null,null,null,0,17,0,"TAI JITSU"]
["12:00:00",null,null,null,null,null,null,null,null,null,null,null,null,null,null,null,null,null,null,null,null,null,0,19,0,"G.VOLONTAIRE"]
["12:15:00",null,null,null,null,null,null,null,null,null,null,null,null,null,null,null,null,null,null,null,null,null,0,20,0,"DIAGONALE"]
["12:30:00",null,null,null,null,null,null,null,null,null,null,null,null,null,null,null,null,null,null,null,null,null,0,21,0,"A.C.E (1)"]
["12:45:00",null,null,null,null,null,null,null,null,null,null,null,null,null,null,null,null,null,null,null,null,null,0,23,0,"ESCALADE"]
["13:00:00",null,null,null,null,null,null,null,null,null,null,null,null,null,null,null,null,null,null,null,null,null,0,24,0,"ARCHERS"]
["13:15:00",null,null,null,null,null,null,null,null,null,null,null,null,null,null,null,null,null,null,null,null,null,0.3125,27,30,"O.C.E"]
["13:30:00",null,null,null,null,null,null,null,null,null,null,null,null,null,null,null,null,null,null,null,null,null,0,28,0,"LAI MUOI"]
["13:45:00",null,null,null,null,null,null,null,null,null,null,null,null,null,null,null,null,null,null,null,null,null,0,30,0,"TAEKWONDO"]
["14:00:00",null,null,null,null,null,null,null,null,null,null,null,null,null,null,null,null,null,null,null,null,null,0,31,0,"E.S.A.G.A.M.I"]
["14:15:00",null,null,null,null,null,null,null,null,null,null,null,null,null,null,null,null,null,null,null,null,null,0,32,0,"ALEETT"]
["14:30:00",null,null,null,null,null,null,null,null,null,null,null,null,null,null,null,null,null,null,null,null,null,0,34,0,"SPIRIT 38"]
["14:45:00",null,null,null,null,null,null,null,null,null,null,null,null,null,null,null,null,null,null,null,null,null,0,35,0,"GMC38EYBENS"]
["15:00:00",null,null,null,null,null,null,null,null,null,null,null,null,null,null,null,null,null,null,null,null,null,0,36,0,"PETANQUE"]
["15:15:00",null,null,null,null,null,null,null,null,null,null,null,null,null,null,null,null,null,null,null,null,null,0,37,0,"HBC2E"]
["15:30:00",null,null,null,null,null,null,null,null,null,null,null,null,null,null,null,null,null,null,null,null,null,0,38,0,"-"]
["15:45:00",null,null,null,null,null,null,null,null,null,null,null,null,null,null,null,null,null,null,null,null,null,0,39,0,"-"]
["16:00:00",null,null,null,null,null,null,null,null,null,null,null,null,null,null,null,null,null,null,null,null,null,{"$f":"Y30*15/1440","v":0},50,0,"SCOLAIRE"]
["16:15:00",null,null,null,null,null,null,null,null,null,null,null,null,null,null,null,null,null,null,null,null,null,0,51,0,"Sport Passion"]
["16:30:00",null,null,null,null,null,null,null,null,null,null,null,null,null,null,null,null,null,null,null,null,null,0,52,0,"Péri Scolaire"]
["16:45:00",null,null,null,null,null,null,null,27,null,null,null,null,null,null,null,null,null,null,null,null,null,0,53,0,"Crêche Familiale"]
["17:00:00",null,null,null,null,null,null,null,27,null,null,null,null,null,null,null,null,null,null,null,null,null,0,54,0,{"$f":"INDEX(UTILISATEURS,MATCH(X34,RefUtil,0),2)","v":"Rel Ass Matern"}]
["17:15:00",null,null,null,null,null,null,null,27,null,null,null,null,null,null,null,null,null,null,null,null,null,0,55,0,"?Pôle Enfance"]
["17:30:00",null,null,null,null,null,null,null,27,null,null,null,null,null,null,null,null,null,null,null,null,null,0,56,0,"Anim. Municip."]
["17:45:00",null,null,null,null,null,null,null,27,null,null,null,null,null,null,null,null,null,null,null,null,null,0,57,0,"Crêche P Chose"]
["18:00:00",null,null,null,null,null,null,null,27,null,null,null,null,null,null,null,null,null,null,null,null,null,0,58,0,0]
["18:15:00",null,null,null,null,null,null,null,"v",null,null,null,null,null,null,null,null,null,null,null,null,null,0,59,0,"Police Municip"]
["18:30:00",null,null,null,null,null,null,null,"v",null,null,null,null,null,null,null,null,null,null,null,null,null,0,60,0,0]
["18:45:00",null,null,null,null,27,null,null,27,null,null,27,null,null,27,null,null,null,null,null,null,null,0,61,0,"-"]
["19:00:00",null,null,null,null,27,null,null,27,null,null,27,null,null,27,null,null,null,null,null,null,null,0,62,0,"EN ATTENTE"]
["19:15:00",null,null,null,null,27,null,null,27,null,null,27,null,null,27,null,null,null,null,null,null,null,0,63,0,{"$error":"#N/A"}]
["19:30:00",null,null,null,null,27,null,null,27,null,null,27,null,null,27,null,null,null,null,null,null,null,0,100,0,"POISAT"]
["19:45:00",null,null,null,null,27,null,null,27,null,null,27,null,null,27,null,null,null,null,null,null,null,0,101,0,"ECHIROLLES"]
["20:00:00",null,null,null,null,27,null,null,27,null,null,27,null,null,27,null,null,null,null,null,null,null,0,102,0,"H.P."]
["20:15:00",null,null,null,null,null,null,null,null,null,null,null,null,null,null,null,null,null,null,null,null,null,0,103,0,"I.M.E."]
["20:30:00",null,null,null,null,null,null,null,null,null,null,null,null,null,null,null,null,null,null,null,null,null,0,104,0,0]
["20:45:00",null,null,null,null,null,null,null,null,null,null,null,null,null,null,null,null,null,null,null,null,null,0,105,0,"Gendarm. Eybens"]
["21:00:00",null,null,null,null,null,null,null,null,null,null,null,null,null,null,null,null,null,null,null,null,null,0,106,0,0]
["21:15:00",null,null,null,null,null,null,null,null,null,null,null,null,null,null,null,null,null,null,null,null,null,0,107,0,"D.Country"]
["21:30:00",null,null,null,null,null,null,null,null,null,null,null,null,null,null,null,null,null,null,null,null,null,0,108,0,"CE SOPRA"]
["21:45:00",null,null,null,null,null,null,null,null,null,null,null,null,null,null,null,null,null,null,null,null,null,0,109,0,"ASCE"]
["22:00:00",null,null,null,null,null,null,null,null,null,null,null,null,null,null,null,null,null,null,null,null,null,0,110,0,"HARMONIE EYBENS"]
["22:15:00",null,null,null,null,null,null,null,null,null,null,null,null,null,null,null,null,null,null,null,null,null,0,111,0,0]
["22:30:00"]
[]
[null,null,null,null,null,null,null,null,null,null,null,null,null,null,null,null,null,null,null,null,null,null,{"$f":"Y58*15/1440","v":0.3125},null,{"$f":"SUM(Y2:Y57)","v":30}]
["00:15:00",null,null,null,null,null,null,null,null,null,null,null,null,null,null,null,null,null,"Page N°",{"$f":"VLOOKUP($U$1,EQUIPEMENT,3)","v":11}]

{"sheet":"L","index":12,"n_rows":59,"n_cols":26,"rows_kept":59,"cut":false,"hidden":false,"merged":[[1,19,1,21],[59,3,59,15],[0,4,0,18],[1,1,1,3],[1,4,1,6],[1,7,1,9],[1,10,1,12],[1,13,1,15],[1,16,1,18],[0,1,0,3]]}
[{"$f":"INDEX(EQUIPEMENT,MATCH($U$1,ID,0),4)","v":"L"},{"$f":"SAISON","v":"2019-2020"},null,null,{"$f":"INDEX(EQUIPEMENT,MATCH($U$1,ID,0),2)","v":"Stade Charles PIOT"},null,null,null,null,null,null,null,null,null,null,null,null,null,null,null,"L",null,"Hr","REF","NB 1/4 H","NOMS"]
["09:00:00","Lundi",null,null,"Mardi",null,null,"Mercredi",null,null,"Jeudi",null,null,"Vendredi",null,null,"Samedi",null,null,"Dimanche",null,null,{"$f":"Y2*15/1440","v":0},1,{"$f":"COUNTIF($B$3:$V$56,X2)","v":0},{"$f":"INDEX(UTILISATEURS,MATCH(X2,RefUtil,0),2)","v":"OMS"}]
[{"$f":"+A2+$A$59","v":"09:15:00"},null,null,null,null,null,null,null,null,null,null,null,null,null,null,null,null,null,null,null,null,null,{"$f":"Y3*15/1440","v":0},3,{"$f":"COUNTIF($B$3:$V$56,X3)","v":0},"J.B.E."]
["09:30:00",null,null,null,null,null,null,null,null,null,null,null,null,null,null,null,null,null,null,null,null,null,0,4,0,"GYM LOISIR"]
["09:45:00",null,null,null,null,null,null,null,null,null,null,null,null,null,null,null,null,null,null,null,null,null,0,5,0,"BASKET"]
["10:00:00",null,null,null,null,null,null,null,null,null,null,null,null,null,null,null,null,null,null,null,null,null,0,7,0,"CYCLOS"]
["10:15:00",null,null,null,null,null,null,null,null,null,null,null,null,null,null,null,null,null,null,null,null,null,0,9,0,"GAULE"]
["10:30:00",null,null,null,null,null,null,null,null,null,null,null,null,null,null,null,null,null,null,null,null,null,0,10,0,"JUDO"]
["10:45:00",null,null,null,null,null,null,null,null,null,null,null,null,null,null,null,null,null,null,null,null,null,0,11,0,"LUTTE"]
["11:00:00",null,null,null,null,null,null,null,null,null,null,null,null,null,null,null,null,null,null,null,null,null,0,14,0,"T C D"]
["11:15:00",null,null,null,null,null,null,null,null,null,null,null,null,null,null,null,null,null,null,null,null,null,0,15,0,"TENNIS  (2)"]
["11:30:00",null,null,null,null,null,null,null,null,null,null,null,null,null,null,null,null,null,null,null,null,null,0,16,0,"CIRQUE (1)"]
["11:45:00",null,null,null,null,null,null,null,null,null,null,null,null,null,null,null,null,null,null,null,null,null,0,17,0,"TAI JITSU"]
["12:00:00",null,null,null,null,null,null,null,null,null,null,null,null,null,null,null,null,null,null,null,null,null,0,19,0,"G.VOLONTAIRE"]
["12:15:00",null,null,null,null,null,null,null,null,null,null,null,null,null,null,null,null,null,null,null,null,null,0,20,0,"DIAGONALE"]
["12:30:00",null,null,null,null,null,null,null,null,null,null,null,null,null,null,null,null,null,null,null,null,null,0,21,0,"A.C.E (1)"]
["12:45:00",null,null,null,null,null,null,null,null,null,null,null,null,null,null,null,null,null,null,null,null,null,0,23,0,"ESCALADE"]
["13:00:00",null,null,null,null,null,null,null,null,null,null,null,null,null,null,null,null,null,null,null,null,null,0,24,0,"ARCHERS"]
["13:15:00",null,null,null,null,null,null,null,null,null,null,null,null,null,null,null,null,null,null,null,null,null,0.78125,27,75,"O.C.E"]
["13:30:00",null,null,null,null,null,null,null,null,null,null,null,null,null,null,null,null,null,null,null,null,null,0,28,0,"LAI MUOI"]
["13:45:00",null,null,null,null,null,null,null,27,null,null,null,null,null,null,null,null,null,null,null,null,null,0,30,0,"TAEKWONDO"]
["14:00:00",null,null,null,null,null,null,null,27,null,null,null,null,null,null,null,null,null,null,null,null,null,0,31,0,"E.S.A.G.A.M.I"]
["14:15:00",null,null,null,null,null,null,null,27,null,null,null,null,null,null,null,null,null,null,null,null,null,0,32,0,"ALEETT"]
["14:30:00",null,null,null,null,null,null,null,27,null,null,null,null,null,null,null,null,null,null,null,null,null,0,34,0,"SPIRIT 38"]
["14:45:00",null,null,null,null,null,null,null,27,null,null,null,null,null,null,null,null,null,null,null,null,null,0,35,0,"GMC38EYBENS"]
["15:00:00",null,null,null,null,null,null,null,27,null,null,null,null,null,null,null,null,null,null,null,null,null,0,36,0,"PETANQUE"]
["15:15:00",null,null,null,null,null,null,null,27,null,null,null,null,null,null,null,null,null,null,null,null,null,0,37,0,"HBC2E"]
["15:30:00",null,null,null,null,null,null,null,27,null,null,null,null,null,null,null,null,null,null,null,null,null,0,38,0,"-"]
["15:45:00",null,null,null,null,null,null,null,27,null,null,null,null,null,null,null,null,null,null,null,null,null,0,39,0,"-"]
["16:00:00",null,null,null,null,null,null,null,27,null,null,null,null,null,null,null,null,null,null,null,null,null,{"$f":"Y30*15/1440","v":0},50,0,"SCOLAIRE"]
["16:15:00",null,null,null,null,null,null,null,27,null,null,null,null,null,null,null,null,null,null,null,null,null,0,51,0,"Sport Passion"]
["16:30:00",null,null,null,null,null,null,null,27,null,null,null,null,null,null,null,null,null,null,null,null,null,0,52,0,"Péri Scolaire"]
["16:45:00",null,27,null,null,null,null,null,27,null,null,null,null,null,null,null,null,null,null,null,null,null,0,53,0,"Crêche Familiale"]
["17:00:00",null,27,null,null,null,null,null,27,null,null,null,null,null,null,null,null,null,null,null,null,null,0,54,0,{"$f":"INDEX(UTILISATEURS,MATCH(X34,RefUtil,0),2)","v":"Rel Ass Matern"}]
["17:15:00",null,27,null,null,null,null,null,27,null,null,null,null,null,null,null,null,null,null,null,null,null,0,55,0,"?Pôle Enfance"]
["17:30:00",null,27,null,null,null,null,null,27,null,null,null,null,null,null,null,null,null,null,null,null,null,0,56,0,"Anim. Municip."]
["17:45:00",null,27,null,null,null,null,null,27,null,null,null,null,null,null,null,null,null,null,null,null,null,0,57,0,"Crêche P Chose"]
["18:00:00",null,27,null,null,null,null,null,27,null,null,null,null,null,null,null,null,null,null,null,null,null,0,58,0,0]
["18:15:00",null,27,null,null,null,null,null,27,null,null,null,null,null,27,null,null,null,null,null,null,null,0,59,0,"Police Municip"]
["18:30:00",null,27,null,null,null,null,null,27,null,null,null,null,null,27,null,null,null,null,null,null,null,0,60,0,0]
["18:45:00",null,27,null,null,27,null,null,27,null,null,null,null,null,27,null,null,null,null,null,null,null,0,61,0,"-"]
["19:00:00",null,27,null,null,27,null,null,27,null,null,null,null,null,27,null,null,null,null,null,null,null,0,62,0,"EN ATTENTE"]
["19:15:00",null,27,null,null,27,null,null,27,null,null,null,null,null,27,null,null,null,null,null,null,null,0,63,0,{"$error":"#N/A"}]
["19:30:00",null,27,null,null,27,null,null,27,null,null,null,null,null,27,null,null,null,null,null,null,null,0,100,0,"POISAT"]
["19:45:00",null,27,null,null,27,null,null,27,null,null,27,null,null,27,null,null,null,null,null,null,null,0,101,0,"ECHIROLLES"]
["20:00:00",null,27,null,null,27,null,null,27,null,null,27,null,null,27,null,null,null,null,null,null,null,0,102,0,"H.P."]
["20:15:00",null,27,null,null,27,null,null,27,null,null,27,null,null,27,null,null,null,null,null,null,null,0,103,0,"I.M.E."]
["20:30:00",null,27,null,null,27,null,null,27,null,null,27,null,null,27,null,null,null,null,null,null,null,0,104,0,0]
["20:45:00",null,null,null,null,27,null,null,27,null,null,27,null,null,27,null,null,null,null,null,null,null,0,105,0,"Gendarm. Eybens"]
["21:00:00",null,null,null,null,27,null,null,27,null,null,27,null,null,27,null,null,null,null,null,null,null,0,106,0,0]
["21:15:00",null,null,null,null,27,null,null,null,null,null,null,null,null,null,null,null,null,null,null,null,null,0,107,0,"D.Country"]
["21:30:00",null,null,null,null,null,null,null,null,null,null,null,null,null,null,null,null,null,null,null,null,null,0,108,0,"CE SOPRA"]
["21:45:00",null,null,null,null,null,null,null,null,null,null,null,null,null,null,null,null,null,null,null,null,null,0,109,0,"ASCE"]
["22:00:00",null,null,null,null,null,null,null,null,null,null,null,null,null,null,null,null,null,null,null,null,null,0,110,0,"HARMONIE EYBENS"]
["22:15:00",null,null,null,null,null,null,null,null,null,null,null,null,null,null,null,null,null,null,null,null,null,0,111,0,0]
["22:30:00"]
[]
[null,null,null,null,null,null,null,null,null,null,null,null,null,null,null,null,null,null,null,null,null,null,{"$f":"Y58*15/1440","v":0.78125},null,{"$f":"SUM(Y2:Y57)","v":75}]
["00:15:00",null,null,null,null,null,null,null,null,null,null,null,null,null,null,null,null,null,"Page N°",{"$f":"VLOOKUP($U$1,EQUIPEMENT,3)","v":12}]

{"sheet":"M","index":13,"n_rows":59,"n_cols":26,"rows_kept":59,"cut":false,"hidden":false,"merged":[[1,19,1,21],[59,3,59,15],[0,4,0,18],[1,1,1,3],[1,4,1,6],[1,7,1,9],[1,10,1,12],[1,13,1,15],[1,16,1,18],[0,1,0,3]]}
[{"$f":"INDEX(EQUIPEMENT,MATCH($U$1,ID,0),4)","v":"( N )"},{"$f":"SAISON","v":"2019-2020"},null,null,{"$f":"INDEX(EQUIPEMENT,MATCH($U$1,ID,0),2)","v":"Salle de la Tuilerie"},null,null,null,null,null,null,null,null,null,null,null,null,null,null,null,"M",null,"Hr","REF","NB 1/4 H","NOMS"]
["09:00:00","Lundi",null,null,"Mardi",null,null,"Mercredi",null,null,"Jeudi",null,null,"Vendredi",null,null,"Samedi",null,null,"Dimanche",null,null,{"$f":"Y2*15/1440","v":0},1,{"$f":"COUNTIF($B$3:$V$56,X2)","v":0},{"$f":"INDEX(UTILISATEURS,MATCH(X2,RefUtil,0),2)","v":"OMS"}]
[{"$f":"+A2+$A$59","v":"09:15:00"},null,null,null,null,null,null,null,null,null,null,null,null,null,null,null,null,null,null,null,null,null,{"$f":"Y3*15/1440","v":0},3,{"$f":"COUNTIF($B$3:$V$56,X3)","v":0},"J.B.E."]
["09:30:00",null,null,null,null,null,null,null,null,null,null,null,null,null,null,null,null,null,null,null,null,null,0,4,0,"GYM LOISIR"]
["09:45:00",null,null,null,null,null,null,null,null,null,null,null,null,null,null,null,null,null,null,null,null,null,0,5,0,"BASKET"]
["10:00:00",null,null,null,null,null,null,null,null,null,null,null,null,null,null,null,null,null,null,null,null,null,0,7,0,"CYCLOS"]
["10:15:00",null,null,null,null,null,null,null,null,null,null,null,null,null,null,null,null,null,null,null,null,null,0,9,0,"GAULE"]
["10:30:00",null,null,null,null,null,null,null,null,null,null,null,null,null,null,null,null,null,null,null,null,null,0,10,0,"JUDO"]
["10:45:00",null,null,null,null,null,null,null,null,null,null,null,null,null,null,null,null,null,null,null,null,null,0,11,0,"LUTTE"]
["11:00:00",null,null,null,null,null,null,null,null,null,null,null,null,null,null,null,null,null,null,null,null,null,0,14,0,"T C D"]
["11:15:00",null,null,null,null,null,null,null,null,null,null,null,null,null,null,null,null,null,null,null,null,null,0,15,0,"TENNIS  (2)"]
["11:30:00",null,null,null,null,null,null,null,null,null,null,null,null,null,null,null,null,null,null,null,null,null,0,16,0,"CIRQUE (1)"]
["11:45:00",null,null,null,null,null,null,null,null,null,null,null,null,null,null,null,null,null,null,null,null,null,0,17,0,"TAI JITSU"]
["12:00:00",null,null,null,null,null,null,null,null,null,null,null,null,null,null,null,null,null,null,null,null,null,0,19,0,"G.VOLONTAIRE"]
["12:15:00",null,null,null,null,null,null,null,null,null,null,null,null,null,null,null,null,null,null,null,null,null,0.20833333333333334,20,20,"DIAGONALE"]
["12:30:00",null,null,null,null,null,null,null,null,null,null,null,null,null,null,null,null,null,null,null,null,null,0,21,0,"A.C.E (1)"]
["12:45:00",null,null,null,null,null,null,null,null,null,null,null,null,null,null,null,null,null,null,null,null,null,0,23,0,"ESCALADE"]
["13:00:00",null,null,null,null,null,null,null,null,null,null,null,null,null,null,null,null,null,null,null,null,null,0,24,0,"ARCHERS"]
["13:15:00",null,null,null,null,null,null,null,null,null,null,null,null,null,null,null,null,null,null,null,null,null,0,27,0,"O.C.E"]
["13:30:00",null,null,null,null,null,null,null,null,null,null,null,null,null,null,null,null,null,null,null,null,null,0,28,0,"LAI MUOI"]
["13:45:00",null,null,null,null,null,null,null,null,null,null,null,null,null,null,null,null,null,null,null,null,null,0,30,0,"TAEKWONDO"]
["14:00:00",null,null,null,null,null,null,null,20,null,null,null,null,null,null,null,null,null,null,null,null,null,0,31,0,"E.S.A.G.A.M.I"]
["14:15:00",null,null,null,null,null,null,null,20,null,null,null,null,null,null,null,null,null,null,null,null,null,0,32,0,"ALEETT"]
["14:30:00",null,null,null,null,null,null,null,20,null,null,null,null,null,null,null,null,null,null,null,null,null,0,34,0,"SPIRIT 38"]
["14:45:00",null,null,null,null,null,null,null,20,null,null,null,null,null,null,null,null,null,null,null,null,null,0,35,0,"GMC38EYBENS"]
["15:00:00",null,null,null,null,null,null,null,20,null,null,null,null,null,null,null,null,null,null,null,null,null,0,36,0,"PETANQUE"]
["15:15:00",null,null,null,null,null,null,null,20,null,null,null,null,null,null,null,null,null,null,null,null,null,0,37,0,"HBC2E"]
["15:30:00",null,null,null,null,null,null,null,20,null,null,null,null,null,null,null,null,null,null,null,null,null,0,38,0,"-"]
["15:45:00",null,null,null,null,null,null,null,20,null,null,null,null,null,null,null,null,null,null,null,null,null,0,39,0,"-"]
["16:00:00",null,null,null,null,null,null,null,20,null,null,null,null,null,null,null,null,null,null,null,null,null,{"$f":"Y30*15/1440","v":0},50,0,"SCOLAIRE"]
["16:15:00",null,null,null,null,null,null,null,20,null,null,null,null,null,null,null,null,null,null,null,null,null,0,51,0,"Sport Passion"]
["16:30:00",null,null,null,null,null,null,null,null,null,null,null,null,null,null,null,null,null,null,null,null,null,0,52,0,"Péri Scolaire"]
["16:45:00",null,null,null,null,null,null,null,null,null,null,null,null,null,null,null,null,null,null,null,null,null,0,53,0,"Crêche Familiale"]
["17:00:00",null,null,null,null,null,null,null,null,null,null,null,null,null,null,null,null,null,null,null,null,null,0,54,0,{"$f":"INDEX(UTILISATEURS,MATCH(X34,RefUtil,0),2)","v":"Rel Ass Matern"}]
["17:15:00",null,null,null,null,null,null,null,null,null,null,null,null,null,null,null,null,null,null,null,null,null,0,55,0,"?Pôle Enfance"]
["17:30:00",null,null,null,null,null,null,null,null,null,null,null,null,null,null,null,null,null,null,null,null,null,0,56,0,"Anim. Municip."]
["17:45:00",null,null,null,null,null,null,null,null,null,null,null,null,null,null,null,null,null,null,null,null,null,0,57,0,"Crêche P Chose"]
["18:00:00",null,null,null,null,null,null,null,null,null,null,null,null,null,null,null,null,null,null,null,null,null,0,58,0,0]
["18:15:00",null,null,null,null,null,null,null,null,null,null,null,null,null,null,null,null,null,null,null,null,null,0,59,0,"Police Municip"]
["18:30:00",null,null,null,null,null,null,null,null,null,null,null,null,null,null,null,null,null,null,null,null,null,0,60,0,0]
["18:45:00",null,null,null,null,null,null,null,null,null,null,null,null,null,null,null,null,null,null,null,null,null,0,61,0,"-"]
["19:00:00",null,null,null,null,null,null,null,null,null,null,null,null,null,null,null,null,null,null,null,null,null,0,62,0,"EN ATTENTE"]
["19:15:00",null,null,null,null,null,null,null,null,null,null,null,null,null,null,null,null,null,null,null,null,null,0,63,0,{"$error":"#N/A"}]
["19:30:00",null,null,null,null,null,null,null,null,null,null,null,null,null,null,null,null,null,null,null,null,null,0,100,0,"POISAT"]
["19:45:00",null,null,null,null,null,null,null,null,null,null,null,null,null,null,null,null,null,null,null,null,null,0,101,0,"ECHIROLLES"]
["20:00:00",null,null,null,null,null,null,null,null,null,null,null,null,null,null,null,null,null,null,null,null,null,0,102,0,"H.P."]
["20:15:00",null,null,null,null,null,null,null,null,null,null,null,null,null,20,null,null,null,null,null,null,null,0,103,0,"I.M.E."]
["20:30:00",null,null,null,null,null,null,null,null,null,null,null,null,null,20,null,null,null,null,null,null,null,0,104,0,0]
["20:45:00",null,null,null,null,null,null,null,null,null,null,null,null,null,20,null,null,null,null,null,null,null,0,105,0,"Gendarm. Eybens"]
["21:00:00",null,null,null,null,null,null,null,null,null,null,null,null,null,20,null,null,null,null,null,null,null,0,106,0,0]
["21:15:00",null,null,null,null,null,null,null,null,null,null,null,null,null,20,null,null,null,null,null,null,null,0,107,0,"D.Country"]
["21:30:00",null,null,null,null,null,null,null,null,null,null,null,null,null,20,null,null,null,null,null,null,null,0,108,0,"CE SOPRA"]
["21:45:00",null,null,null,null,null,null,null,null,null,null,null,null,null,20,null,null,null,null,null,null,null,0,109,0,"ASCE"]
["22:00:00",null,null,null,null,null,null,null,null,null,null,null,null,null,20,null,null,null,null,null,null,null,0,110,0,"HARMONIE EYBENS"]
["22:15:00",null,null,null,null,null,null,null,null,null,null,null,null,null,20,null,null,null,null,null,null,null,0,111,0,0]
["22:30:00",null,null,null,null,null,null,null,null,null,null,null,null,null,20]
[]
[null,null,null,null,null,null,null,null,null,null,null,null,null,null,null,null,null,null,null,null,null,null,{"$f":"Y58*15/1440","v":0.20833333333333334},null,{"$f":"SUM(Y2:Y57)","v":20}]
["00:15:00",null,null,null,null,null,null,null,null,null,null,null,null,null,null,null,null,null,"Page N°",{"$f":"VLOOKUP($U$1,EQUIPEMENT,3)","v":13}]

{"sheet":"N1","index":14,"n_rows":59,"n_cols":26,"rows_kept":59,"cut":false,"hidden":false,"merged":[[1,19,1,21],[59,3,59,15],[0,4,0,18],[1,1,1,3],[1,4,1,6],[1,7,1,9],[1,10,1,12],[1,13,1,15],[1,16,1,18],[0,1,0,3]]}
[{"$f":"INDEX(EQUIPEMENT,MATCH($U$1,ID,0),4)","v":"( O )"},{"$f":"SAISON","v":"2019-2020"},null,null,{"$f":"INDEX(EQUIPEMENT,MATCH($U$1,ID,0),2)","v":"Tennis Couverts  court N°1"},null,null,null,null,null,null,null,null,null,null,null,null,null,null,null,"N1",null,"Hr","REF","NB 1/4 H","NOMS"]
["09:00:00","Lundi",null,null,"Mardi",null,null,"Mercredi",null,null,"Jeudi",null,null,"Vendredi",null,null,"Samedi",null,null,"Dimanche",null,null,{"$f":"Y2*15/1440","v":0},1,{"$f":"COUNTIF($B$3:$V$56,X2)","v":0},{"$f":"INDEX(UTILISATEURS,MATCH(X2,RefUtil,0),2)","v":"OMS"}]
[{"$f":"+A2+$A$59","v":"09:15:00"},null,"v",null,null,null,null,null,null,null,null,null,null,null,null,null,null,null,null,null,null,null,{"$f":"Y3*15/1440","v":0},3,{"$f":"COUNTIF($B$3:$V$56,X3)","v":0},"J.B.E."]
["09:30:00",null,"v",null,null,null,null,null,null,null,null,null,null,null,null,null,null,null,null,null,null,null,0,4,0,"GYM LOISIR"]
["09:45:00",null,"v",null,null,null,null,null,null,null,null,null,null,null,null,null,null,null,null,null,null,null,0,5,0,"BASKET"]
["10:00:00",null,"v",null,null,null,null,null,null,null,null,null,null,null,null,null,null,null,null,null,null,null,0,7,0,"CYCLOS"]
["10:15:00",null,"v",null,null,15,null,null,15,null,null,null,null,null,15,null,null,15,null,null,15,null,0,9,0,"GAULE"]
["10:30:00",null,"v",null,null,15,null,null,15,null,null,null,null,null,15,null,null,15,null,null,15,null,0,10,0,"JUDO"]
["10:45:00",null,"v",null,null,15,null,null,15,null,null,null,null,null,15,null,null,15,null,null,15,null,0,11,0,"LUTTE"]
["11:00:00",null,"v",null,null,15,null,null,15,null,null,null,null,null,15,null,null,15,null,null,15,null,0,14,0,"T C D"]
["11:15:00",null,"v",null,null,15,null,null,15,null,null,null,null,null,15,null,null,15,null,null,15,null,3.3541666666666665,15,322,"TENNIS  (2)"]
["11:30:00",null,"v",null,null,15,null,null,15,null,null,null,null,null,15,null,null,15,null,null,15,null,0,16,0,"CIRQUE (1)"]
["11:45:00",null,"v",null,null,15,null,null,15,null,null,null,null,null,15,null,null,15,null,null,15,null,0,17,0,"TAI JITSU"]
["12:00:00",null,"v",null,null,15,null,null,15,null,null,null,null,null,15,null,null,15,null,null,15,null,0,19,0,"G.VOLONTAIRE"]
["12:15:00",null,15,null,null,15,null,null,15,null,null,15,null,null,15,null,null,15,null,null,15,null,0,20,0,"DIAGONALE"]
["12:30:00",null,15,null,null,15,null,null,15,null,null,15,null,null,15,null,null,15,null,null,15,null,0,21,0,"A.C.E (1)"]
["12:45:00",null,15,null,null,15,null,null,15,null,null,15,null,null,15,null,null,15,null,null,15,null,0,23,0,"ESCALADE"]
["13:00:00",null,15,null,null,15,null,null,15,null,null,15,null,null,15,null,null,15,null,null,15,null,0,24,0,"ARCHERS"]
["13:15:00",null,15,null,null,15,null,null,15,null,null,15,null,null,15,null,null,15,null,null,15,null,0,27,0,"O.C.E"]
["13:30:00",null,15,null,null,15,null,null,15,null,null,15,null,null,15,null,null,15,null,null,15,null,0,28,0,"LAI MUOI"]
["13:45:00",null,15,null,null,15,null,null,15,null,null,15,null,null,15,null,null,15,null,null,15,null,0,30,0,"TAEKWONDO"]
["14:00:00",null,15,null,null,15,null,null,15,null,null,15,null,null,15,null,null,15,null,null,15,null,0,31,0,"E.S.A.G.A.M.I"]
["14:15:00",null,15,null,null,15,null,null,15,null,null,15,null,null,15,null,null,15,null,null,15,null,0,32,0,"ALEETT"]
["14:30:00",null,15,null,null,15,null,null,15,null,null,15,null,null,15,null,null,15,null,null,15,null,0,34,0,"SPIRIT 38"]
["14:45:00",null,15,null,null,15,null,null,15,null,null,15,null,null,15,null,null,15,null,null,15,null,0,35,0,"GMC38EYBENS"]
["15:00:00",null,15,null,null,15,null,null,15,null,null,15,null,null,15,null,null,15,null,null,15,null,0,36,0,"PETANQUE"]
["15:15:00",null,15,null,null,15,null,null,15,null,null,15,null,null,15,null,null,15,null,null,15,null,0,37,0,"HBC2E"]
["15:30:00",null,15,null,null,15,null,null,15,null,null,15,null,null,15,null,null,15,null,null,15,null,0,38,0,"-"]
["15:45:00",null,15,null,null,15,null,null,15,null,null,15,null,null,15,null,null,15,null,null,15,null,0,39,0,"-"]
["16:00:00",null,15,null,null,15,null,null,15,null,null,15,null,null,15,null,null,15,null,null,15,null,{"$f":"Y30*15/1440","v":0},50,0,"SCOLAIRE"]
["16:15:00",null,15,null,null,15,null,null,15,null,null,15,null,null,15,null,null,15,null,null,15,null,0,51,0,"Sport Passion"]
["16:30:00",null,15,null,null,15,null,null,15,null,null,15,null,null,15,null,null,15,null,null,15,null,0,52,0,"Péri Scolaire"]
["16:45:00",null,15,null,null,15,null,null,15,null,null,15,null,null,15,null,null,15,null,null,15,null,0,53,0,"Crêche Familiale"]
["17:00:00",null,15,null,null,15,null,null,15,null,null,15,null,null,15,null,null,15,null,null,15,null,0,54,0,{"$f":"INDEX(UTILISATEURS,MATCH(X34,RefUtil,0),2)","v":"Rel Ass Matern"}]
["17:15:00",null,15,null,null,15,null,null,15,null,null,15,null,null,15,null,null,15,null,null,15,null,0,55,0,"?Pôle Enfance"]
["17:30:00",null,15,null,null,15,null,null,15,null,null,15,null,null,15,null,null,15,null,null,15,null,0,56,0,"Anim. Municip."]
["17:45:00",null,15,null,null,15,null,null,15,null,null,15,null,null,15,null,null,15,null,null,15,null,0,57,0,"Crêche P Chose"]
["18:00:00",null,15,null,null,15,null,null,15,null,null,15,null,null,15,null,null,15,null,null,15,null,0,58,0,0]
["18:15:00",null,15,null,null,15,null,null,15,null,null,15,null,null,15,null,null,15,null,null,15,null,0,59,0,"Police Municip"]
["18:30:00",null,15,null,null,15,null,null,15,null,null,15,null,null,15,null,null,15,null,null,15,null,0,60,0,0]
["18:45:00",null,15,null,null,15,null,null,15,null,null,15,null,null,15,null,null,15,null,null,15,null,0,61,0,"-"]
["19:00:00",null,15,null,null,15,null,null,15,null,null,15,null,null,15,null,null,15,null,null,15,null,0,62,0,"EN ATTENTE"]
["19:15:00",null,15,null,null,15,null,null,15,null,null,15,null,null,15,null,null,15,null,null,15,null,0,63,0,{"$error":"#N/A"}]
["19:30:00",null,15,null,null,15,null,null,15,null,null,15,null,null,15,null,null,15,null,null,15,null,0,100,0,"POISAT"]
["19:45:00",null,15,null,null,15,null,null,15,null,null,15,null,null,15,null,null,15,null,null,15,null,0,101,0,"ECHIROLLES"]
["20:00:00",null,15,null,null,15,null,null,15,null,null,15,null,null,15,null,null,15,null,null,15,null,0,102,0,"H.P."]
["20:15:00",null,15,null,null,15,null,null,15,null,null,15,null,null,15,null,null,15,null,null,15,null,0,103,0,"I.M.E."]
["20:30:00",null,15,null,null,15,null,null,15,null,null,15,null,null,15,null,null,15,null,null,15,null,0,104,0,0]
["20:45:00",null,15,null,null,15,null,null,15,null,null,15,null,null,15,null,null,15,null,null,15,null,0,105,0,"Gendarm. Eybens"]
["21:00:00",null,15,null,null,15,null,null,15,null,null,15,null,null,15,null,null,15,null,null,15,null,0,106,0,0]
["21:15:00",null,15,null,null,15,null,null,15,null,null,15,null,null,15,null,null,15,null,null,15,null,0,107,0,"D.Country"]
["21:30:00",null,15,null,null,15,null,null,15,null,null,15,null,null,15,null,null,15,null,null,15,null,0,108,0,"CE SOPRA"]
["21:45:00",null,15,null,null,15,null,null,15,null,null,15,null,null,15,null,null,15,null,null,15,null,0,109,0,"ASCE"]
["22:00:00",null,15,null,null,15,null,null,15,null,null,15,null,null,15,null,null,15,null,null,15,null,0,110,0,"HARMONIE EYBENS"]
["22:15:00",null,15,null,null,15,null,null,"v",null,null,"v",null,null,"v",null,null,null,null,null,null,null,0,111,0,0]
["22:30:00",null,"v",null,null,"v",null,null,"v",null,null,"v",null,null,"v",null,null,null,null,null,null,null,null,null,{"$f":"COUNTIF($B$3:$V$56,X56)","v":0},{"$f":"VLOOKUP(X56,UTILISATEURS,2)","v":{"$error":"#N/A"}}]
[null,null,null,null,null,null,null,null,null,null,null,null,null,null,null,null,null,null,null,null,null,null,null,null,null,{"$f":"VLOOKUP(X57,UTILISATEURS,2)","v":{"$error":"#N/A"}}]
[null,null,null,null,null,null,null,null,null,null,null,null,null,null,null,null,null,null,null,null,null,null,{"$f":"Y58*15/1440","v":3.3541666666666665},null,{"$f":"SUM(Y2:Y57)","v":322}]
["00:15:00",null,null,null,null,null,null,null,null,null,null,null,null,null,null,null,null,null,"Page N°",{"$f":"VLOOKUP($U$1,EQUIPEMENT,3)","v":14}]

{"sheet":"N2","index":15,"n_rows":59,"n_cols":26,"rows_kept":59,"cut":false,"hidden":false,"merged":[[1,19,1,21],[59,3,59,15],[0,4,0,18],[1,1,1,3],[1,4,1,6],[1,7,1,9],[1,10,1,12],[1,13,1,15],[1,16,1,18],[0,1,0,3]]}
[{"$f":"INDEX(EQUIPEMENT,MATCH($U$1,ID,0),4)","v":"( O )"},{"$f":"SAISON","v":"2019-2020"},null,null,{"$f":"INDEX(EQUIPEMENT,MATCH($U$1,ID,0),2)","v":"Tennis Couverts  court N°2"},null,null,null,null,null,null,null,null,null,null,null,null,null,null,null,"N2",null,"Hr","REF","NB 1/4 H","NOMS"]
["09:00:00","Lundi",null,null,"Mardi",null,null,"Mercredi",null,null,"Jeudi",null,null,"Vendredi",null,null,"Samedi",null,null,"Dimanche",null,null,{"$f":"Y2*15/1440","v":0},1,{"$f":"COUNTIF($B$3:$V$56,X2)","v":0},{"$f":"INDEX(UTILISATEURS,MATCH(X2,RefUtil,0),2)","v":"OMS"}]
[{"$f":"+A2+$A$59","v":"09:15:00"},null,15,null,null,15,null,null,15,null,null,15,null,null,15,null,null,15,null,null,15,null,{"$f":"Y3*15/1440","v":0},3,{"$f":"COUNTIF($B$3:$V$56,X3)","v":0},"J.B.E."]
["09:30:00",null,15,null,null,15,null,null,15,null,null,15,null,null,15,null,null,15,null,null,15,null,0,4,0,"GYM LOISIR"]
["09:45:00",null,15,null,null,15,null,null,15,null,null,15,null,null,15,null,null,15,null,null,15,null,0,5,0,"BASKET"]
["10:00:00",null,15,null,null,15,null,null,15,null,null,15,null,null,15,null,null,15,null,null,15,null,0,7,0,"CYCLOS"]
["10:15:00",null,15,null,null,15,null,null,15,null,null,15,null,null,15,null,null,15,null,null,15,null,0,9,0,"GAULE"]
["10:30:00",null,15,null,null,15,null,null,15,null,null,15,null,null,15,null,null,15,null,null,15,null,0,10,0,"JUDO"]
["10:45:00",null,15,null,null,15,null,null,15,null,null,15,null,null,15,null,null,15,null,null,15,null,0,11,0,"LUTTE"]
["11:00:00",null,15,null,null,15,null,null,15,null,null,15,null,null,15,null,null,15,null,null,15,null,0,14,0,{"$f":"INDEX(UTILISATEURS,MATCH(X10,RefUtil,0),2)","v":"T C D"}]
["11:15:00",null,15,null,null,15,null,null,15,null,null,15,null,null,15,null,null,15,null,null,15,null,3.8541666666666665,15,370,"TENNIS  (2)"]
["11:30:00",null,15,null,null,15,null,null,15,null,null,15,null,null,15,null,null,15,null,null,15,null,0,16,0,"CIRQUE (1)"]
["11:45:00",null,15,null,null,15,null,null,15,null,null,15,null,null,15,null,null,15,null,null,15,null,0,17,0,"TAI JITSU"]
["12:00:00",null,15,null,null,15,null,null,15,null,null,15,null,null,15,null,null,15,null,null,15,null,0,19,0,"G.VOLONTAIRE"]
["12:15:00",null,15,null,null,null,102,null,15,null,null,null,102,null,15,null,null,15,null,null,15,null,0,20,0,"DIAGONALE"]
["12:30:00",null,15,null,null,null,102,null,15,null,null,null,102,null,15,null,null,15,null,null,15,null,0,21,0,"A.C.E (1)"]
["12:45:00",null,15,null,null,null,102,null,15,null,null,null,102,null,15,null,null,15,null,null,15,null,0,23,0,"ESCALADE"]
["13:00:00",null,15,null,null,null,102,null,15,null,null,null,102,null,15,null,null,15,null,null,15,null,0,24,0,"ARCHERS"]
["13:15:00",null,15,null,null,15,null,null,15,null,null,15,null,null,15,null,null,15,null,null,15,null,0,27,0,"O.C.E"]
["13:30:00",null,15,null,null,15,null,null,15,null,null,15,null,null,15,null,null,15,null,null,15,null,0,28,0,"LAI MUOI"]
["13:45:00",null,15,null,null,15,null,null,15,null,null,15,null,null,15,null,null,15,null,null,15,null,0,30,0,"TAEKWONDO"]
["14:00:00",null,15,null,null,15,null,null,15,null,null,15,null,null,15,null,null,15,null,null,15,null,0,31,0,"E.S.A.G.A.M.I"]
["14:15:00",null,15,null,null,15,null,null,15,null,null,15,null,null,15,null,null,15,null,null,15,null,0,32,0,"ALEETT"]
["14:30:00",null,15,null,null,15,null,null,15,null,null,15,null,null,15,null,null,15,null,null,15,null,0,34,0,"SPIRIT 38"]
["14:45:00",null,15,null,null,15,null,null,15,null,null,15,null,null,15,null,null,15,null,null,15,null,0,35,0,"GMC38EYBENS"]
["15:00:00",null,15,null,null,15,null,null,15,null,null,15,null,null,15,null,null,15,null,null,15,null,0,36,0,"PETANQUE"]
["15:15:00",null,15,null,null,15,null,null,15,null,null,15,null,null,15,null,null,15,null,null,15,null,0,37,0,"HBC2E"]
["15:30:00",null,15,null,null,15,null,null,15,null,null,15,null,null,15,null,null,15,null,null,15,null,0,38,0,"-"]
["15:45:00",null,15,null,null,15,null,null,15,null,null,15,null,null,15,null,null,15,null,null,15,null,0,39,0,"-"]
["16:00:00",null,15,null,null,15,null,null,15,null,null,15,null,null,15,null,null,15,null,null,15,null,{"$f":"Y30*15/1440","v":0},50,0,"SCOLAIRE"]
["16:15:00",null,15,null,null,15,null,null,15,null,null,15,null,null,15,null,null,15,null,null,15,null,0,51,0,"Sport Passion"]
["16:30:00",null,15,null,null,15,null,null,15,null,null,15,null,null,15,null,null,15,null,null,15,null,0,52,0,"Péri Scolaire"]
["16:45:00",null,15,null,null,15,null,null,15,null,null,15,null,null,15,null,null,15,null,null,15,null,0,53,0,"Crêche Familiale"]
["17:00:00",null,15,null,null,15,null,null,15,null,null,15,null,null,15,null,null,15,null,null,15,null,0,54,0,{"$f":"INDEX(UTILISATEURS,MATCH(X34,RefUtil,0),2)","v":"Rel Ass Matern"}]
["17:15:00",null,15,null,null,15,null,null,15,null,null,15,null,null,15,null,null,15,null,null,15,null,0,55,0,"?Pôle Enfance"]
["17:30:00",null,15,null,null,15,null,null,15,null,null,15,null,null,15,null,null,15,null,null,15,null,0,56,0,"Anim. Municip."]
["17:45:00",null,15,null,null,15,null,null,15,null,null,15,null,null,15,null,null,15,null,null,15,null,0,57,0,"Crêche P Chose"]
["18:00:00",null,15,null,null,15,null,null,15,null,null,15,null,null,15,null,null,15,null,null,15,null,0,58,0,0]
["18:15:00",null,15,null,null,15,null,null,15,null,null,15,null,null,15,null,null,15,null,null,15,null,0,59,0,"Police Municip"]
["18:30:00",null,15,null,null,15,null,null,15,null,null,15,null,null,15,null,null,15,null,null,15,null,0,60,0,0]
["18:45:00",null,15,null,null,15,null,null,15,null,null,15,null,null,15,null,null,15,null,null,15,null,0,61,0,"-"]
["19:00:00",null,15,null,null,15,null,null,15,null,null,15,null,null,15,null,null,15,null,null,15,null,0,62,0,"EN ATTENTE"]
["19:15:00",null,15,null,null,15,null,null,15,null,null,15,null,null,15,null,null,15,null,null,15,null,0,63,0,{"$error":"#N/A"}]
["19:30:00",null,15,null,null,15,null,null,15,null,null,15,null,null,15,null,null,15,null,null,15,null,0,100,0,"POISAT"]
["19:45:00",null,15,null,null,15,null,null,15,null,null,15,null,null,15,null,null,15,null,null,15,null,0,101,0,"ECHIROLLES"]
["20:00:00",null,15,null,null,15,null,null,15,null,null,15,null,null,15,null,null,15,null,null,15,null,8.3333333333333329E-2,102,8,"H.P."]
["20:15:00",null,15,null,null,15,null,null,15,null,null,15,null,null,15,null,null,15,null,null,15,null,0,103,0,"I.M.E."]
["20:30:00",null,15,null,null,15,null,null,15,null,null,15,null,null,15,null,null,15,null,null,15,null,0,104,0,0]
["20:45:00",null,15,null,null,15,null,null,15,null,null,15,null,null,15,null,null,15,null,null,15,null,0,105,0,"Gendarm. Eybens"]
["21:00:00",null,15,null,null,15,null,null,15,null,null,15,null,null,15,null,null,15,null,null,15,null,0,106,0,0]
["21:15:00",null,15,null,null,15,null,null,15,null,null,15,null,null,15,null,null,15,null,null,15,null,0,107,0,"D.Country"]
["21:30:00",null,15,null,null,15,null,null,15,null,null,15,null,null,15,null,null,15,null,null,15,null,0,108,0,"CE SOPRA"]
["21:45:00",null,15,null,null,15,null,null,15,null,null,15,null,null,15,null,null,15,null,null,15,null,0,109,0,"ASCE"]
["22:00:00",null,15,null,null,15,null,null,15,null,null,15,null,null,15,null,null,15,null,null,15,null,0,110,0,"HARMONIE EYBENS"]
["22:15:00",null,15,null,null,15,null,null,15,null,null,15,null,null,15,null,null,15,null,null,15,null,0,111,0,0]
["22:30:00",null,15,null,null,15,null,null,15,null,null,15,null,null,15,null,null,15,null,null,15]
[]
[null,null,null,null,null,null,null,null,null,null,null,null,null,null,null,null,null,null,null,null,null,null,{"$f":"Y58*15/1440","v":3.9375},null,{"$f":"SUM(Y2:Y57)","v":378}]
["00:15:00",null,null,null,null,null,null,null,null,null,null,null,null,null,null,null,null,null,"Page N°",{"$f":"VLOOKUP($U$1,EQUIPEMENT,3)","v":15}]

{"sheet":"O","index":16,"n_rows":59,"n_cols":26,"rows_kept":59,"cut":false,"hidden":false,"merged":[[1,19,1,21],[59,3,59,15],[0,4,0,18],[1,1,1,3],[1,4,1,6],[1,7,1,9],[1,10,1,12],[1,13,1,15],[1,16,1,18],[0,1,0,3]]}
[{"$f":"INDEX(EQUIPEMENT,MATCH($U$1,ID,0),4)","v":"P"},{"$f":"SAISON","v":"2019-2020"},null,null,{"$f":"INDEX(EQUIPEMENT,MATCH($U$1,ID,0),2)","v":"Salle A.D.C rue du Grand Veymont"},null,null,null,null,null,null,null,null,null,null,null,null,null,null,null,"O",null,"Hr","REF","NB 1/4 H","NOMS"]
["09:00:00","Lundi",null,null,"Mardi",null,null,"Mercredi",null,null,"Jeudi",null,null,"Vendredi",null,null,"Samedi",null,null,"Dimanche",null,null,{"$f":"Y2*15/1440","v":0},1,{"$f":"COUNTIF($B$3:$V$56,X2)","v":0},{"$f":"INDEX(UTILISATEURS,MATCH(X2,RefUtil,0),2)","v":"OMS"}]
[{"$f":"+A2+$A$59","v":"09:15:00"},null,"E",null,null,"v",null,null,16,null,null,"v",null,null,"v",null,null,16,null,null,null,null,{"$f":"Y3*15/1440","v":0},3,{"$f":"COUNTIF($B$3:$V$56,X3)","v":0},"J.B.E."]
["09:30:00",null,"E",null,null,"v",null,null,16,null,null,"v",null,null,"v",null,null,16,null,null,null,null,0,4,0,"GYM LOISIR"]
["09:45:00",null,"E",null,null,16,null,null,16,null,null,"v",null,null,"v",null,null,16,null,null,null,null,0,5,0,"BASKET"]
["10:00:00",null,"E",null,null,16,null,null,16,null,null,"v",null,null,"v",null,null,16,null,null,null,null,0,7,0,"CYCLOS"]
["10:15:00",null,"E",null,null,16,null,null,16,null,null,"v",null,null,"v",null,null,16,null,null,null,null,0,9,0,"GAULE"]
["10:30:00",null,"E",null,null,16,null,null,16,null,null,"v",null,null,"v",null,null,16,null,null,null,null,0,10,0,"JUDO"]
["10:45:00",null,"E",null,null,16,null,null,16,null,null,"v",null,null,"v",null,null,16,null,null,null,null,0,11,0,"LUTTE"]
["11:00:00",null,"E",null,null,16,null,null,16,null,null,"v",null,null,"v",null,null,16,null,null,null,null,0,14,0,"T C D"]
["11:15:00",null,"E",null,null,16,null,null,16,null,null,"v",null,null,"v",null,null,16,null,null,null,null,0,15,0,"TENNIS  (2)"]
["11:30:00",null,"E",null,null,16,null,null,16,null,null,"v",null,null,"v",null,null,16,null,null,null,null,2.1041666666666665,16,202,"CIRQUE (1)"]
["11:45:00",null,"E",null,null,16,null,null,16,null,null,"v",null,null,"v",null,null,16,null,null,null,null,0,17,0,"TAI JITSU"]
["12:00:00",null,"E",null,null,16,null,null,16,null,null,"v",null,null,"v",null,null,16,null,null,null,null,0,19,0,"G.VOLONTAIRE"]
["12:15:00",null,"E",null,null,"v",null,null,16,null,null,"v",null,null,"v",null,null,16,null,null,null,null,0,20,0,"DIAGONALE"]
["12:30:00",null,"E",null,null,"v",null,null,16,null,null,"v",null,null,"v",null,null,16,null,null,null,null,0,21,0,"A.C.E (1)"]
["12:45:00",null,"v",null,null,"v",null,null,"v",null,null,"v",null,null,"v",null,null,16,null,null,null,null,0,23,0,"ESCALADE"]
["13:00:00",null,"v",null,null,"v",null,null,"v",null,null,"v",null,null,"v",null,null,16,null,null,null,null,0,24,0,"ARCHERS"]
["13:15:00",null,16,null,null,"v",null,null,"v",null,null,"v",null,null,"v",null,null,16,null,null,null,null,0,27,0,"O.C.E"]
["13:30:00",null,16,null,null,"v",null,null,"v",null,null,"v",null,null,"v",null,null,16,null,null,null,null,0,28,0,"LAI MUOI"]
["13:45:00",null,16,null,null,"v",null,null,"v",null,null,"v",null,null,"v",null,null,16,null,null,null,null,0,30,0,"TAEKWONDO"]
["14:00:00",null,16,null,null,16,null,null,16,null,null,"v",null,null,"v",null,null,16,null,null,null,null,0,31,0,"E.S.A.G.A.M.I"]
["14:15:00",null,16,null,null,16,null,null,16,null,null,"v",null,null,"v",null,null,16,null,null,null,null,0,32,0,"ALEETT"]
["14:30:00",null,16,null,null,16,null,null,16,null,null,"v",null,null,"v",null,null,16,null,null,null,null,0,34,0,"SPIRIT 38"]
["14:45:00",null,16,null,null,16,null,null,16,null,null,"v",null,null,"v",null,null,16,null,null,null,null,0,35,0,"GMC38EYBENS"]
["15:00:00",null,16,null,null,16,null,null,16,null,null,"v",null,null,"v",null,null,16,null,null,null,null,0,36,0,"PETANQUE"]
["15:15:00",null,16,null,null,16,null,null,16,null,null,"v",null,null,"v",null,null,16,null,null,null,null,0,37,0,"HBC2E"]
["15:30:00",null,16,null,null,16,null,null,16,null,null,"v",null,null,"v",null,null,16,null,null,null,null,0,38,0,"-"]
["15:45:00",null,16,null,null,16,null,null,16,null,null,"v",null,null,"v",null,null,16,null,null,null,null,0,39,0,"-"]
["16:00:00",null,16,null,null,16,null,null,16,null,null,"v",null,null,"v",null,null,16,null,null,null,null,{"$f":"Y30*15/1440","v":0},50,0,"SCOLAIRE"]
["16:15:00",null,16,null,null,16,null,null,16,null,null,"v",null,null,"v",null,null,16,null,null,null,null,0,51,0,"Sport Passion"]
["16:30:00",null,16,null,null,16,null,null,16,null,null,"v",null,null,"v",null,null,16,null,null,null,null,0,52,0,"Péri Scolaire"]
["16:45:00",null,"v",null,null,"v",null,null,16,null,null,"v",null,null,"v",null,null,16,null,null,null,null,0,53,0,"Crêche Familiale"]
["17:00:00",null,16,null,null,"v",null,null,16,null,null,16,null,null,"v",null,null,16,null,null,null,null,0,54,0,"Rel Ass Matern"]
["17:15:00",null,16,null,null,16,null,null,16,null,null,16,null,null,"v",null,null,16,null,null,null,null,0,55,0,"?Pôle Enfance"]
["17:30:00",null,16,null,null,16,null,null,16,null,null,16,null,null,16,null,null,16,null,null,null,null,0,56,0,"Anim. Municip."]
["17:45:00",null,16,null,null,16,null,null,16,null,null,16,null,null,16,null,null,16,null,null,null,null,0,57,0,"Crêche P Chose"]
["18:00:00",null,16,null,null,16,null,null,16,null,null,16,null,null,16,null,null,16,null,null,null,null,0,58,0,0]
["18:15:00",null,16,null,null,16,null,null,16,null,null,16,null,null,16,null,null,"v",null,null,null,null,0,59,0,"Police Municip"]
["18:30:00",null,16,null,null,16,null,null,16,null,null,16,null,null,16,null,null,"v",null,null,null,null,0,60,0,0]
["18:45:00",null,16,null,null,16,null,null,16,null,null,16,null,null,16,null,null,"v",null,null,null,null,0,61,0,"-"]
["19:00:00",null,16,null,null,16,null,null,16,null,null,16,null,null,16,null,null,"v",null,null,null,null,0,62,0,"EN ATTENTE"]
["19:15:00",null,16,null,null,16,null,null,16,null,null,16,null,null,16,null,null,"v",null,null,null,null,0,63,0,{"$error":"#N/A"}]
["19:30:00",null,"v",null,null,16,null,null,16,null,null,16,null,null,16,null,null,"v",null,null,null,null,0,100,0,"POISAT"]
["19:45:00",null,16,null,null,16,null,null,16,null,null,16,null,null,16,null,null,"v",null,null,null,null,0,101,0,"ECHIROLLES"]
["20:00:00",null,16,null,null,16,null,null,16,null,null,16,null,null,16,null,null,"v",null,null,null,null,0,102,0,"H.P."]
["20:15:00",null,16,null,null,"v",null,null,16,null,null,16,null,null,16,null,null,"v",null,null,null,null,0,103,0,"I.M.E."]
["20:30:00",null,16,null,null,16,null,null,16,null,null,16,null,null,16,null,null,"v",null,null,null,null,0,104,0,0]
["20:45:00",null,16,null,null,16,null,null,16,null,null,16,null,null,16,null,null,"v",null,null,null,null,0,105,0,"Gendarm. Eybens"]
["21:00:00",null,16,null,null,16,null,null,16,null,null,16,null,null,16,null,null,"v",null,null,null,null,0,106,0,0]
["21:15:00",null,16,null,null,16,null,null,16,null,null,16,null,null,16,null,null,"v",null,null,null,null,0,107,0,"D.Country"]
["21:30:00",null,16,null,null,16,null,null,16,null,null,16,null,null,16,null,null,"v",null,null,null,null,0,108,0,"CE SOPRA"]
["21:45:00",null,16,null,null,16,null,null,16,null,null,16,null,null,16,null,null,"v",null,null,null,null,0,109,0,"ASCE"]
["22:00:00",null,16,null,null,16,null,null,16,null,null,16,null,null,16,null,null,"v",null,null,null,null,0,110,0,"HARMONIE EYBENS"]
["22:15:00",null,"v",null,null,16,null,null,"v",null,null,16,null,null,16,null,null,"v",null,null,null,null,0,111,0,0]
["22:30:00",null,"v",null,null,"v",null,null,"v",null,null,16,null,null,16,null,null,"v",null,null,null,null,0,null,0]
[null,null,null,null,null,null,null,null,null,null,null,null,null,null,null,null,null,null,null,null,null,null,0,null,0]
[null,null,null,null,null,null,null,null,null,null,null,null,null,null,null,null,null,null,null,null,null,null,{"$f":"Y58*15/1440","v":2.1041666666666665},null,{"$f":"SUM(Y2:Y57)","v":202}]
["00:15:00",null,null,null,null,null,null,null,null,null,null,null,null,null,null,null,null,null,"Page N°",{"$f":"VLOOKUP($U$1,EQUIPEMENT,3)","v":16}]

{"sheet":"MODELE","index":17,"n_rows":59,"n_cols":26,"rows_kept":59,"cut":false,"hidden":false,"merged":[[0,0,0,3],[0,4,0,18],[59,3,59,15]]}
[{"$f":"SAISON","v":"2019-2020"},null,null,null,{"$f":"VLOOKUP($U$1,EQUIPEMENT,2)","v":"Salle Polyvalente du BOULODROMME"},null,null,null,null,null,null,null,null,null,null,null,null,null,null,null,"A",null,"Hr","REF","NB 1/4 H","NOMS"]
["09:00:00",null,"LUNDI",null,null,"MARDI",null,null,"MERCREDI",null,null,"JEUDI",null,null,"VENDREDI",null,null,"SAMEDI",null,"Dimanche",null,null,{"$f":"Y2*15/1440","v":0},1,{"$f":"COUNTIF($B$3:$V$56,X2)","v":0},{"$f":"INDEX(UTILISATEURS,MATCH(X2,RefUtil,0),2)","v":"OMS"}]
[{"$f":"+A2+$A$59","v":"09:15:00"},null,null,null,null,null,null,null,null,null,null,null,null,null,null,null,null,null,null,null,null,null,{"$f":"Y3*15/1440","v":0},3,{"$f":"COUNTIF($B$3:$V$56,X3)","v":0},"J.B.E."]
["09:30:00",null,null,null,null,null,null,null,null,null,null,null,null,null,null,null,null,null,null,null,null,null,0,4,0,"GYM LOISIR"]
["09:45:00",null,null,null,null,null,null,null,null,null,null,null,null,null,null,null,null,null,null,null,null,null,0,5,0,"BASKET"]
["10:00:00",null,null,null,null,null,null,null,null,null,null,null,null,null,null,null,null,null,null,null,null,null,0,7,0,"CYCLOS"]
["10:15:00",null,null,null,null,null,null,null,null,null,null,null,null,null,null,null,null,null,null,null,null,null,0,9,0,"GAULE"]
["10:30:00",null,null,null,null,null,null,null,null,null,null,null,null,null,null,null,null,null,null,null,null,null,0,10,0,"JUDO"]
["10:45:00",null,null,null,null,null,null,null,null,null,null,null,null,null,null,null,null,null,null,null,null,null,0,11,0,"LUTTE"]
["11:00:00",null,null,null,null,null,null,null,null,null,null,null,null,null,null,null,null,null,null,null,null,null,0,14,0,"T C D"]
["11:15:00",null,null,null,null,null,null,null,null,null,null,null,null,null,null,null,null,null,null,null,null,null,0,15,0,"TENNIS  (2)"]
["11:30:00",null,null,null,null,null,null,null,null,null,null,null,null,null,null,null,null,null,null,null,null,null,0,16,0,"CIRQUE (1)"]
["11:45:00",null,null,null,null,null,null,null,null,null,null,null,null,null,null,null,null,null,null,null,null,null,0,17,0,"TAI JITSU"]
["12:00:00",null,null,null,null,null,null,null,null,null,null,null,null,null,null,null,null,null,null,null,null,null,0,19,0,"G.VOLONTAIRE"]
["12:15:00",null,null,null,null,null,null,null,null,null,null,null,null,null,null,null,null,null,null,null,null,null,0,20,0,"DIAGONALE"]
["12:30:00",null,null,null,null,null,null,null,null,null,null,null,null,null,null,null,null,null,null,null,null,null,0,21,0,"A.C.E (1)"]
["12:45:00",null,null,null,null,null,null,null,null,null,null,null,null,null,null,null,null,null,null,null,null,null,0,23,0,"ESCALADE"]
["13:00:00",null,null,null,null,null,null,null,null,null,null,null,null,null,null,null,null,null,null,null,null,null,0,24,0,"ARCHERS"]
["13:15:00",null,null,null,null,null,null,null,null,null,null,null,null,null,null,null,null,null,null,null,null,null,0,27,0,"O.C.E"]
["13:30:00",null,null,null,null,null,null,null,null,null,null,null,null,null,null,null,null,null,null,null,null,null,0,28,0,"LAI MUOI"]
["13:45:00",null,null,null,null,null,null,null,null,null,null,null,null,null,null,null,null,null,null,null,null,null,0,30,0,"TAEKWONDO"]
["14:00:00",null,null,null,null,null,null,null,null,null,null,null,null,null,null,null,null,null,null,null,null,null,0,31,0,"E.S.A.G.A.M.I"]
["14:15:00",null,null,null,null,null,null,null,null,null,null,null,null,null,null,null,null,null,null,null,null,null,0,32,0,"ALEETT"]
["14:30:00",null,null,null,null,null,null,null,null,null,null,null,null,null,null,null,null,null,null,null,null,null,0,34,0,"SPIRIT 38"]
["14:45:00",null,null,null,null,null,null,null,null,null,null,null,null,null,null,null,null,null,null,null,null,null,0,35,0,"GMC38EYBENS"]
["15:00:00",null,null,null,null,null,null,null,null,null,null,null,null,null,null,null,null,null,null,null,null,null,0,36,0,"PETANQUE"]
["15:15:00",null,null,null,null,null,null,null,null,null,null,null,null,null,null,null,null,null,null,null,null,null,0,37,0,"HBC2E"]
["15:30:00",null,null,null,null,null,null,null,null,null,null,null,null,null,null,null,null,null,null,null,null,null,0,null,0,{"$error":"#N/A"}]
["15:45:00",null,null,null,null,null,null,null,null,null,null,null,null,null,null,null,null,null,null,null,null,null,0,null,0,{"$error":"#N/A"}]
["16:00:00",null,null,null,null,null,null,null,null,null,null,null,null,null,null,null,null,null,null,null,null,null,{"$f":"Y30*15/1440","v":0},50,0,"SCOLAIRE"]
["16:15:00",null,null,null,null,null,null,null,null,null,null,null,null,null,null,null,null,null,null,null,null,null,0,51,0,"Sport Passion"]
["16:30:00",null,null,null,null,null,null,null,null,null,null,null,null,null,null,null,null,null,null,null,null,null,0,52,0,"Péri Scolaire"]
["16:45:00",null,null,null,null,null,null,null,null,null,null,null,null,null,null,null,null,null,null,null,null,null,0,53,0,"Crêche Familiale"]
["17:00:00",null,null,null,null,null,null,null,null,null,null,null,null,null,null,null,null,null,null,null,null,null,0,54,0,"Rel Ass Matern"]
["17:15:00",null,null,null,null,null,null,null,null,null,null,null,null,null,null,null,null,null,null,null,null,null,0,55,0,"?Pôle Enfance"]
["17:30:00",null,null,null,null,null,null,null,null,null,null,null,null,null,null,null,null,null,null,null,null,null,0,56,0,"Anim. Municip."]
["17:45:00",null,null,null,null,null,null,null,null,null,null,null,null,null,null,null,null,null,null,null,null,null,0,57,0,"Crêche P Chose"]
["18:00:00",null,null,null,null,null,null,null,null,null,null,null,null,null,null,null,null,null,null,null,null,null,0,58,0,0]
["18:15:00",null,null,null,null,null,null,null,null,null,null,null,null,null,null,null,null,null,null,null,null,null,0,59,0,"Police Municip"]
["18:30:00",null,null,null,null,null,null,null,null,null,null,null,null,null,null,null,null,null,null,null,null,null,0,60,0,0]
["18:45:00",null,null,null,null,null,null,null,null,null,null,null,null,null,null,null,null,null,null,null,null,null,0,61,0,"-"]
["19:00:00",null,null,null,null,null,null,null,null,null,null,null,null,null,null,null,null,null,null,null,null,null,0,62,0,"EN ATTENTE"]
["19:15:00",null,null,null,null,null,null,null,null,null,null,null,null,null,null,null,null,null,null,null,null,null,0,63,0,{"$error":"#N/A"}]
["19:30:00",null,null,null,null,null,null,null,null,null,null,null,null,null,null,null,null,null,null,null,null,null,0,100,0,"POISAT"]
["19:45:00",null,null,null,null,null,null,null,null,null,null,null,null,null,null,null,null,null,null,null,null,null,0,101,0,"ECHIROLLES"]
["20:00:00",null,null,null,null,null,null,null,null,null,null,null,null,null,null,null,null,null,null,null,null,null,0,102,0,"H.P."]
["20:15:00",null,null,null,null,null,null,null,null,null,null,null,null,null,null,null,null,null,null,null,null,null,0,103,0,"I.M.E."]
["20:30:00",null,null,null,null,null,null,null,null,null,null,null,null,null,null,null,null,null,null,null,null,null,0,104,0,0]
["20:45:00",null,null,null,null,null,null,null,null,null,null,null,null,null,null,null,null,null,null,null,null,null,0,105,0,"Gendarm. Eybens"]
["21:00:00",null,null,null,null,null,null,null,null,null,null,null,null,null,null,null,null,null,null,null,null,null,0,106,0,0]
["21:15:00",null,null,null,null,null,null,null,null,null,null,null,null,null,null,null,null,null,null,null,null,null,0,107,0,"D.Country"]
["21:30:00",null,null,null,null,null,null,null,null,null,null,null,null,null,null,null,null,null,null,null,null,null,0,108,0,"CE SOPRA"]
["21:45:00",null,null,null,null,null,null,null,null,null,null,null,null,null,null,null,null,null,null,null,null,null,0,109,0,"ASCE"]
["22:00:00",null,null,null,null,null,null,null,null,null,null,null,null,null,null,null,null,null,null,null,null,null,0,110,0,"HARMONIE EYBENS"]
["22:15:00",null,null,null,null,null,null,null,null,null,null,null,null,null,null,null,null,null,null,null,null,null,0,111,0,0]
["22:30:00",null,null,null,null,null,null,null,null,null,null,null,null,null,null,null,null,null,null,null,null,null,0,null,0]
[]
[null,null,null,null,null,null,null,null,null,null,null,null,null,null,null,null,null,null,null,null,null,null,{"$f":"Y58*15/1440","v":0},null,{"$f":"SUM(Y2:Y57)","v":0}]
["00:15:00",null,null,null,null,null,null,null,null,null,null,null,null,null,null,null,null,null,"Page N°",{"$f":"VLOOKUP($U$1,EQUIPEMENT,3)","v":1}]

{"sheet":"Récap OMS","index":18,"n_rows":33,"n_cols":21,"rows_kept":33,"cut":false,"hidden":false,"merged":[]}
[null,{"$f":"'EQPT&UTIL'!B25","v":"2019-2020"},null,null,"TABLEAU DES UTILISATEURS MEMBRES O.M.S."]
[null,null,null,"TEMPS",null,"LES EQUIPEMENTS REFERENCES /Heures : Minutes",null,null,null,null,null,null,null,null,null,"M",null,"N"]
[null,"REF","Eq Ut","Heures","UTILISATEURS","A","B","C","D","E","F","G","H","I","J","K","L","M","N1","N2","O"]
[null,null,null,null,null,"Salle poly Boulodrm","Boulodrome","Salle Poly RJ ","Salle 2èm\nF Faivre","Préau Bourg","Gym\nR Journet","Salle C\nF Faivre","Salle B\nF Faivre","Salle Muscu\nF Faivre","Stade Synthé\nR Journet","Stade Bel Air","Stade C. Piot","Stade Herbe\nR Journet","Salle Tuilerie","Tennis couverts","Salle G; Veymont"]
[null,1,{"$f":"COUNTIF(F5:T5,\">0\")","v":1},{"$f":"SUM(F5:U5)","v":0.125},{"$f":"INDEX(UTILISATEURS,MATCH(B5,RefUtil,0),2)","v":"OMS"},{"$f":"COUNTIF(A_Plage,$B5)*15/1440","v":0},{"$f":"COUNTIF(B_plage,$B5)*15/1440","v":0},{"$f":"COUNTIF(C_plage,$B5)*15/1440","v":0},{"$f":"COUNTIF(D_plage,$B5)*15/1440","v":0},{"$f":"COUNTIF(E_plage,$B5)*15/1440","v":0},{"$f":"COUNTIF(F_plage,$B5)*15/1440","v":0},{"$f":"COUNTIF(G_plage,$B5)*15/1440","v":0},{"$f":"COUNTIF(H_plage,$B5)*15/1440","v":0},{"$f":"COUNTIF(I_plage,$B5)*15/1440","v":0.125},{"$f":"COUNTIF(J_plage,$B5)*15/1440","v":0},{"$f":"COUNTIF(K_plage,$B5)*15/1440","v":0},{"$f":"COUNTIF(L_plage,$B5)*15/1440","v":0},{"$f":"COUNTIF(M_plage,$B5)*15/1440","v":0},{"$f":"COUNTIF(N1_plage,$B5)*15/1440","v":0},{"$f":"COUNTIF(N2_plage,$B5)*15/1440","v":0},{"$f":"COUNTIF(P_plage,$B5)*15/1440","v":0}]
[null,3,{"$f":"COUNTIF(F6:T6,\">0\")","v":1},{"$f":"SUM(F6:U6)","v":1.1979166666666667},"J.B.E.",{"$f":"COUNTIF(A_Plage,$B6)*15/1440","v":0},1.1979166666666667,0,0,0,0,0,0,{"$f":"COUNTIF(I_plage,$B6)*15/1440","v":0},0,0,0,0,0,0,0]
[null,4,4,0.97916666666666663,"GYM LOISIR",{"$f":"COUNTIF(A_Plage,$B7)*15/1440","v":0.13541666666666666},0,0.48958333333333331,0,0.22916666666666666,0,0,0.125,0,0,0,0,0,0,0,0]
[null,5,4,2.3020833333333335,"BASKET",0,0,0,0,0,6.25E-2,1.1666666666666667,0.625,0.44791666666666669,0,0,0,0,0,0,0]
[null,7,1,8.3333333333333329E-2,"CYCLOS",0,0,0,0,0,0,0,0,8.3333333333333329E-2,0,0,0,0,0,0,0]
[null,9,0,0,"GAULE",0,0,0,0,0,0,0,0,0,0,0,0,0,0,0,0]
[null,10,1,0.98958333333333337,"JUDO",0.98958333333333337,0,0,0,0,0,0,0,0,0,0,0,0,0,0,0]
[null,11,1,0.16666666666666666,"LUTTE",0,0,0.16666666666666666,0,0,{"$f":"COUNTIF(F_plage,$B12)*15/1440","v":0},0,0,0,0,0,0,0,0,0,0]
[null,15,2,7.208333333333333,"TENNIS  (2)",0,0,0,0,0,0,0,0,0,0,0,0,0,3.3541666666666665,3.8541666666666665,0]
[null,16,0,2.1041666666666665,"CIRQUE (1)",0,0,0,0,0,0,0,0,0,0,0,0,0,0,0,2.1041666666666665]
[null,17,1,0.39583333333333331,"TAI JITSU",0.39583333333333331,0,0,0,0,0,0,0,0,0,0,0,0,0,0,0]
[null,19,4,0.67708333333333326,"G.VOLONTAIRE",0.29166666666666669,0,0.20833333333333334,0.13541666666666666,4.1666666666666664E-2,0,0,0,0,0,0,0,0,0,0,0]
[null,20,1,0.20833333333333334,"DIAGONALE",0,0,0,0,0,0,0,0,0,0,0,0,0.20833333333333334,0,0,0]
[null,21,0,0,"A.C.E (1)",0,0,0,0,0,0,0,0,0,0,0,0,0,0,0,0]
[null,23,1,0.58333333333333337,"ESCALADE",0,0,0,0,0,0,0,0.58333333333333337,0,0,0,0,0,0,0,0]
[null,24,1,0.63541666666666663,"ARCHERS",0,0.63541666666666663,0,0,0,0,0,0,0,0,0,0,0,0,0,0]
[null,27,3,2.270833333333333,"O.C.E",0,0,0,0,0,0,0,0,0,1.1770833333333333,0.3125,0.78125,0,0,0,0]
[null,28,1,0.16666666666666666,"LAI MUOI",0,0,0.16666666666666666,0,0,0,0,0,0,0,0,0,0,0,0,0]
[null,30,3,0.41666666666666669,"TAEKWONDO",0.10416666666666667,0,0.10416666666666667,0.20833333333333334,0,0,0,0,0,0,0,0,0,0,0,0]
[null,31,3,0.5,"E.S.A.G.A.M.I",0,0.22916666666666666,0,0,0,0,0.13541666666666666,0.13541666666666666,0,0,0,0,0,0,0,0]
[null,32,1,0.5,"ALEETT",0,0,0,0,0,0,0,0.5,0,0,0,0,0,0,0,0]
[null,34,1,0.51041666666666663,"SPIRIT 38",0,0,0.51041666666666663,0,0,0,0,0,0,0,0,0,0,0,0,0]
[null,35,0,0,"GMC38EYBENS",0,0,0,0,0,0,0,0,0,0,0,0,0,0,0,0]
[null,36,1,0.58333333333333337,"PETANQUE",0,0.58333333333333337,0,0,0,0,0,0,0,0,0,0,0,0,0,0]
[null,37,1,1.2291666666666667,"HBC2E",0,0,0,0,0,1.2291666666666667,0,0,0,0,0,0,0,0,0,0]
[null,null,0,0,{"$error":"#N/A"},0,0,0,0,0,0,0,0,0,0,0,0,0,0,0,0]
[null,null,0,0,{"$error":"#N/A"},0,0,0,0,0,0,0,0,0,0,0,0,0,0,0,0]
[]
[null,null,null,{"$f":"SUM(D5:D32)","v":23.833333333333332},null,{"$f":"SUM(F5:F31)","v":1.9166666666666667},2.6458333333333335,1.6458333333333335,0.34375,0.27083333333333331,1.2916666666666667,1.3020833333333335,1.9687500000000002,0.65625000000000011,1.1770833333333333,0.3125,0.78125,0.20833333333333334,3.3541666666666665,3.8541666666666665,2.1041666666666665]

{"sheet":"Récap TOUT","index":19,"n_rows":67,"n_cols":41,"rows_kept":67,"cut":false,"hidden":false,"merged":[[2,2,3,2],[2,3,3,3],[2,1,3,1],[1,5,1,14]]}
[null,{"$f":"'EQPT&UTIL'!B25","v":"2019-2020"}]
[null,null,null,"TEMPS",null,"LES ÉQUIPEMENTS RÉFÉRENCÉS /  En heures/Minutes"]
[null,"REF","Nb Equipt Utilisés","Heures","Salles","A","B","C","D","E","F","G","H","I","J","K","L","M","N1","N2","O"]
[null,null,null,null,"UTILISATEURS","Salle poly Boulodrm","Boulodrome","Salle Poly RJ ","Salle 2èm\nF Faivre","Préau Bourg","Gym\nR Journet","Salle C\nF Faivre","Salle B\nF Faivre","Salle Muscu\nF Faivre","Stade Compet\n R. Journet","Stade Herbe\n R Journet","Stade C. Piot","Salle de La Tuilerie","Tennis C\ncourt 1","Tennis C\ncourt 2","Salle G; Veymont","Equipmt Utilisés"]
[null,1,{"$f":"COUNTIF(F5:U5,\">0\")","v":1},{"$f":"SUM(F5:U5)","v":0.125},{"$f":"INDEX(UTILISATEURS,MATCH(B5,RefUtil,0),2)","v":"OMS"},{"$f":"COUNTIF(A_Plage,$B5)*15/1440","v":0},{"$f":"COUNTIF(B_plage,$B5)*15/1440","v":0},{"$f":"COUNTIF(C_plage,$B5)*15/1440","v":0},{"$f":"COUNTIF(D_plage,$B5)*15/1440","v":0},{"$f":"COUNTIF(E_plage,$B5)*15/1440","v":0},{"$f":"COUNTIF(F_plage,$B5)*15/1440","v":0},{"$f":"COUNTIF(G_plage,$B5)*15/1440","v":0},{"$f":"COUNTIF(H_plage,$B5)*15/1440","v":0},{"$f":"COUNTIF(I_plage,$B5)*15/1440","v":0.125},{"$f":"COUNTIF(J_plage,$B5)*15/1440","v":0},{"$f":"COUNTIF(K_plage,$B5)*15/1440","v":0},{"$f":"COUNTIF(L_plage,$B5)*15/1440","v":0},{"$f":"COUNTIF(M_plage,$B5)*15/1440","v":0},{"$f":"COUNTIF(N1_plage,$B5)*15/1440","v":0},{"$f":"COUNTIF(N2_plage,$B5)*15/1440","v":0},{"$f":"COUNTIF(P_plage,$B5)*15/1440","v":0},{"$f":"CONCATENATE(Z5,AA5,AB5,AC5,AD5,AE5,AF5,AG5,AH5,AI5,AJ5,AK5,AL5,AM5,AN5,AO5,)","v":"I"},null,null,null,{"$f":"IF(F5>0,F$3,\"\")","v":""},{"$f":"IF(G5>0,G$3,\"\")","v":""},"","","","","","",{"$f":"IF(N5>0,N$3,\"\")","v":"I"},{"$f":"IF(O5>0,O$3,\"\")","v":""},{"$f":"IF(P5>0,P$3,\"\")","v":""},{"$f":"IF(Q5>0,Q$3,\"\")","v":""},{"$f":"IF(R5>0,R$3,\"\")","v":""},{"$f":"IF(S5>0,S$3,\"\")","v":""},{"$f":"IF(T5>0,T$3,\"\")","v":""},""]
[null,3,{"$f":"COUNTIF(F6:U6,\">0\")","v":1},{"$f":"SUM(F6:U6)","v":1.1979166666666667},"J.B.E.",0,1.1979166666666667,0,0,0,0,0,0,0,0,0,0,0,0,0,0,{"$f":"CONCATENATE(Z6,AA6,AB6,AC6,AD6,AE6,AF6,AG6,AH6,AI6,AJ6,AK6,AL6,AM6,AN6,AO6,)","v":"B"},null,null,null,{"$f":"IF(F6>0,F$3,\"\")","v":""},{"$f":"IF(G6>0,G$3,\"\")","v":"B"},{"$f":"IF(H6>0,H$3,\"\")","v":""},{"$f":"IF(I6>0,I$3,\"\")","v":""},{"$f":"IF(J6>0,J$3,\"\")","v":""},{"$f":"IF(K6>0,K$3,\"\")","v":""},{"$f":"IF(L6>0,L$3,\"\")","v":""},{"$f":"IF(M6>0,M$3,\"\")","v":""},{"$f":"IF(N6>0,N$3,\"\")","v":""},{"$f":"IF(O6>0,O$3,\"\")","v":""},{"$f":"IF(P6>0,P$3,\"\")","v":""},{"$f":"IF(Q6>0,Q$3,\"\")","v":""},{"$f":"IF(R6>0,R$3,\"\")","v":""},{"$f":"IF(S6>0,S$3,\"\")","v":""},{"$f":"IF(T6>0,T$3,\"\")","v":""},{"$f":"IF(U6>0,U$3,\"\")","v":""}]
[null,4,4,0.97916666666666663,"GYM LOISIR",0.13541666666666666,0,0.48958333333333331,0,0.22916666666666666,0,0,0.125,0,0,0,0,0,0,0,0,"ACEH",null,null,null,"A","","C","","E","","","H","","","","","","","",""]
[null,5,4,2.3020833333333335,"BASKET",0,0,0,0,0,6.25E-2,1.1666666666666667,0.625,0.44791666666666669,0,0,0,0,0,0,0,"FGHI",null,null,null,"","","","","","F","G","H","I","","","","","","",""]
[null,7,1,8.3333333333333329E-2,"CYCLOS",0,0,0,0,0,0,0,0,8.3333333333333329E-2,0,0,0,0,0,0,0,"I",null,null,null,"","","","","","","","","I","","","","","","",""]
[null,9,0,0,"GAULE",0,0,0,0,0,0,0,0,0,0,0,0,0,0,0,0,"",null,null,null,"","","","","","","","","","","","","","","",""]
[null,10,1,0.98958333333333337,"JUDO",0.98958333333333337,0,0,0,0,0,0,0,0,0,0,0,0,0,0,0,"A",null,null,null,"A","","","","","","","","","","","","","","",""]
[null,11,1,0.16666666666666666,"LUTTE",0,0,0.16666666666666666,0,0,0,0,0,0,0,0,0,0,0,0,0,"C",null,null,null,"","","C","","","","","","","","","","","","",""]
[null,15,2,7.208333333333333,{"$f":"INDEX(UTILISATEURS,MATCH(B13,RefUtil,0),2)","v":"TENNIS  (2)"},0,0,0,0,0,0,0,0,0,0,0,0,0,3.3541666666666665,3.8541666666666665,0,"N1N2",null,null,null,"","","","","","","","","","","","","","N1","N2",""]
[null,16,1,2.1041666666666665,"CIRQUE (1)",0,0,0,0,0,0,0,0,0,0,0,0,0,0,0,2.1041666666666665,"O",null,null,null,"","","","","","","","","","","","","","","","O"]
[null,17,1,0.39583333333333331,"TAI JITSU",0.39583333333333331,0,0,0,0,0,0,0,0,0,0,0,0,0,0,0,"A",null,null,null,"A","","","","","","","","","","","","","","",""]
[null,19,4,0.67708333333333326,"G.VOLONTAIRE",0.29166666666666669,0,0.20833333333333334,0.13541666666666666,4.1666666666666664E-2,0,0,0,0,0,0,0,0,0,0,0,"ACDE",null,null,null,"A","","C","D","E","","","","","","","","","","",""]
[null,20,1,0.20833333333333334,"DIAGONALE",0,0,0,0,0,0,0,0,0,0,0,0,0.20833333333333334,0,0,0,"M",null,null,null,"","","","","","","","","","","","","M","","",""]
[null,21,0,0,"A.C.E (1)",0,0,0,0,0,0,0,0,0,0,0,0,0,0,0,0,"",null,null,null,"","","","","","","","","","","","","","","",""]
[null,23,1,0.58333333333333337,"ESCALADE",0,0,0,0,0,0,0,0.58333333333333337,0,0,0,0,0,0,0,0,"H",null,null,null,"","","","","","","","H","","","","","","","",""]
[null,24,1,0.63541666666666663,"ARCHERS",0,0.63541666666666663,0,0,0,0,0,0,0,0,0,0,0,0,0,0,"B",null,null,null,"","B","","","","","","","","","","","","","",""]
[null,27,3,2.270833333333333,"O.C.E",0,0,0,0,0,0,0,0,0,1.1770833333333333,0.3125,0.78125,0,0,0,0,"JKL",null,null,null,"","","","","","","","","","J","K","L","","","",""]
[null,28,1,0.16666666666666666,"LAI MUOI",0,0,0.16666666666666666,0,0,0,0,0,0,0,0,0,0,0,0,0,"C",null,null,null,"","","C","","","","","","","","","","","","",""]
[null,30,3,0.41666666666666669,"TAEKWONDO",0.10416666666666667,0,0.10416666666666667,0.20833333333333334,0,0,0,0,0,0,0,0,0,0,0,0,"ACD",null,null,null,"A","","C","D","","","","","","","","","","","",""]
[null,31,3,0.5,"E.S.A.G.A.M.I",0,0.22916666666666666,0,0,0,0,0.13541666666666666,0.13541666666666666,0,0,0,0,0,0,0,0,"BGH",null,null,null,"","B","","","","","G","H","","","","","","","",""]
[null,32,1,0.5,"ALEETT",0,0,0,0,0,0,0,0.5,0,0,0,0,0,0,0,0,"H",null,null,null,"","","","","","","","H","","","","","","","",""]
[null,34,1,0.51041666666666663,"SPIRIT 38",0,0,0.51041666666666663,0,0,0,0,0,0,0,0,0,0,0,0,0,"C",null,null,null,"","","C","","","","","","","","","","","","",""]
[null,35,0,0,"GMC38EYBENS",0,0,0,0,0,0,0,0,0,0,0,0,0,0,0,0,"",null,null,null,"","","","","","","","","","","","","","","",""]
[null,36,1,0.58333333333333337,"PETANQUE",0,0.58333333333333337,0,0,0,0,0,0,0,0,0,0,0,0,0,0,"B",null,null,null,"","B","","","","","","","","","","","","","",""]
[null,37,1,1.2291666666666667,"HBC2E",0,0,0,0,0,1.2291666666666667,0,0,0,0,0,0,0,0,0,0,"F",null,null,null,"","","","","","F","","","","","","","","","",""]
[null,null,0,{"$f":"SUM(F30:U30)","v":0},{"$f":"INDEX(UTILISATEURS,MATCH(B30,RefUtil,0),2)","v":{"$error":"#N/A"}},{"$f":"COUNTIF(A_Plage,$B30)*15/1440","v":0},{"$f":"COUNTIF(B_plage,$B30)*15/1440","v":0},{"$f":"COUNTIF(C_plage,$B30)*15/1440","v":0},{"$f":"COUNTIF(D_plage,$B30)*15/1440","v":0},{"$f":"COUNTIF(E_plage,$B30)*15/1440","v":0},{"$f":"COUNTIF(F_plage,$B30)*15/1440","v":0},{"$f":"COUNTIF(G_plage,$B30)*15/1440","v":0},{"$f":"COUNTIF(H_plage,$B30)*15/1440","v":0},{"$f":"COUNTIF(I_plage,$B30)*15/1440","v":0},{"$f":"COUNTIF(J_plage,$B30)*15/1440","v":0},{"$f":"COUNTIF(K_plage,$B30)*15/1440","v":0},{"$f":"COUNTIF(L_plage,$B30)*15/1440","v":0},{"$f":"COUNTIF(M_plage,$B30)*15/1440","v":0},{"$f":"COUNTIF(N1_plage,$B30)*15/1440","v":0},{"$f":"COUNTIF(N2_plage,$B30)*15/1440","v":0},{"$f":"COUNTIF(P_plage,$B30)*15/1440","v":0},"",null,null,null,"","","","","","","","","","","","","","","",""]
[null,null,0,0,{"$error":"#N/A"},0,0,0,0,0,0,0,0,0,0,0,0,0,0,0,0,"",null,null,null,"","","","","","","","","","","","","","","",""]
[null,50,5,4,{"$f":"INDEX(UTILISATEURS,MATCH(B32,RefUtil,0),2)","v":"SCOLAIRE"},0,0,0.5,0,0.82291666666666663,0.91666666666666663,0.83333333333333337,0.92708333333333337,0,0,0,0,0,0,0,0,"CEFGH",null,null,null,"","","C","","E","F","G","H","","","","","","","",""]
[null,51,2,0.20833333333333334,{"$f":"INDEX(UTILISATEURS,MATCH(B33,RefUtil,0),2)","v":"Sport Passion"},0,0,0,0,0,0.10416666666666667,0,0.10416666666666667,0,0,0,0,0,0,0,0,"FH",null,null,null,"","","","","","F","","H","","","","","","","",""]
[null,52,4,0.94791666666666663,{"$f":"INDEX(UTILISATEURS,MATCH(B34,RefUtil,0),2)","v":"Péri Scolaire"},0,0,0,0,0.63541666666666663,6.25E-2,0.125,0.125,0,0,0,0,0,0,0,0,"EFGH",null,null,null,"","","","","E","F","G","H","","","","","","","",""]
[null,53,1,0.10416666666666667,{"$f":"INDEX(UTILISATEURS,MATCH(B35,RefUtil,0),2)","v":"Crêche Familiale"},0.10416666666666667,0,0,0,0,0,0,0,0,0,0,0,0,0,0,0,"A",null,null,null,"A","","","","","","","","","","","","","","",""]
[null,54,1,0.10416666666666667,{"$f":"INDEX(UTILISATEURS,MATCH(B36,RefUtil,0),2)","v":"Rel Ass Matern"},0.10416666666666667,0,0,0,0,0,0,0,0,0,0,0,0,0,0,0,"A",null,null,null,"A","","","","","","","","","","","","","","",""]
[null,55,1,1.0416666666666666E-2,"?Pôle Enfance",{"$f":"COUNTIF(A_Plage,$B37)*15/1440","v":0},{"$f":"COUNTIF(B_plage,$B37)*15/1440","v":0},{"$f":"COUNTIF(C_plage,$B37)*15/1440","v":0},{"$f":"COUNTIF(D_plage,$B37)*15/1440","v":0},{"$f":"COUNTIF(E_plage,$B37)*15/1440","v":0},{"$f":"COUNTIF(F_plage,$B37)*15/1440","v":0},{"$f":"COUNTIF(G_plage,$B37)*15/1440","v":0},{"$f":"COUNTIF(H_plage,$B37)*15/1440","v":0},{"$f":"COUNTIF(I_plage,$B37)*15/1440","v":1.0416666666666666E-2},{"$f":"COUNTIF(J_plage,$B37)*15/1440","v":0},{"$f":"COUNTIF(K_plage,$B37)*15/1440","v":0},{"$f":"COUNTIF(L_plage,$B37)*15/1440","v":0},{"$f":"COUNTIF(M_plage,$B37)*15/1440","v":0},{"$f":"COUNTIF(N1_plage,$B37)*15/1440","v":0},{"$f":"COUNTIF(N2_plage,$B37)*15/1440","v":0},{"$f":"COUNTIF(P_plage,$B37)*15/1440","v":0},"I",null,null,null,"","","","","","","","","I","","","","","","",""]
[null,56,1,0.16666666666666666,"Anim. Municip.",0,0,0,0,0,0,0,0,0.16666666666666666,0,0,0,0,0,0,0,"I",null,null,null,"","","","","","","","","I","","","","","","",""]
[null,57,0,0,"Crêche P Chose",0,0,0,0,0,0,0,0,0,0,0,0,0,0,0,0,"",null,null,null,"","","","","","","","","","","","","","","",""]
[null,58,0,0,0,0,0,0,0,0,0,0,0,0,0,0,0,0,0,0,0,"",null,null,null,"","","","","","","","","","","","","","","",""]
[null,59,2,{"$f":"SUM(F41:U41)","v":0.19791666666666669},{"$f":"INDEX(UTILISATEURS,MATCH(B41,RefUtil,0),2)","v":"Police Municip"},{"$f":"COUNTIF(A_Plage,$B41)*15/1440","v":0},{"$f":"COUNTIF(B_plage,$B41)*15/1440","v":0},{"$f":"COUNTIF(C_plage,$B41)*15/1440","v":0},{"$f":"COUNTIF(D_plage,$B41)*15/1440","v":0.125},{"$f":"COUNTIF(E_plage,$B41)*15/1440","v":0},{"$f":"COUNTIF(F_plage,$B41)*15/1440","v":0},{"$f":"COUNTIF(G_plage,$B41)*15/1440","v":0},{"$f":"COUNTIF(H_plage,$B41)*15/1440","v":7.2916666666666671E-2},{"$f":"COUNTIF(I_plage,$B41)*15/1440","v":0},{"$f":"COUNTIF(J_plage,$B41)*15/1440","v":0},{"$f":"COUNTIF(K_plage,$B41)*15/1440","v":0},{"$f":"COUNTIF(L_plage,$B41)*15/1440","v":0},{"$f":"COUNTIF(M_plage,$B41)*15/1440","v":0},{"$f":"COUNTIF(N1_plage,$B41)*15/1440","v":0},{"$f":"COUNTIF(N2_plage,$B41)*15/1440","v":0},{"$f":"COUNTIF(P_plage,$B41)*15/1440","v":0},"DH",null,null,null,"","","","D","","","","H","","","","","","","",""]
[null,60,0,{"$f":"SUM(F42:U42)","v":0},0,{"$f":"COUNTIF(A_Plage,$B42)*15/1440","v":0},{"$f":"COUNTIF(B_plage,$B42)*15/1440","v":0},{"$f":"COUNTIF(C_plage,$B42)*15/1440","v":0},{"$f":"COUNTIF(D_plage,$B42)*15/1440","v":0},{"$f":"COUNTIF(E_plage,$B42)*15/1440","v":0},{"$f":"COUNTIF(F_plage,$B42)*15/1440","v":0},{"$f":"COUNTIF(G_plage,$B42)*15/1440","v":0},{"$f":"COUNTIF(H_plage,$B42)*15/1440","v":0},{"$f":"COUNTIF(I_plage,$B42)*15/1440","v":0},{"$f":"COUNTIF(J_plage,$B42)*15/1440","v":0},{"$f":"COUNTIF(K_plage,$B42)*15/1440","v":0},{"$f":"COUNTIF(L_plage,$B42)*15/1440","v":0},{"$f":"COUNTIF(M_plage,$B42)*15/1440","v":0},{"$f":"COUNTIF(N1_plage,$B42)*15/1440","v":0},{"$f":"COUNTIF(N2_plage,$B42)*15/1440","v":0},{"$f":"COUNTIF(P_plage,$B42)*15/1440","v":0},"",null,null,null,"","","","","","","","","","","","","","","",""]
[null,61,0,0,"-",0,0,0,0,0,0,0,0,0,0,0,0,0,0,0,0,"",null,null,null,"","","","","","","","","","","","","","","",""]
[null,100,2,0.5,"POISAT",0,0,0,0.25,0,0,0.25,0,0,0,0,0,0,0,0,0,"DG",null,null,null,"","","","D","","","G","","","","","","","","",""]
[null,101,0,0,"ECHIROLLES",0,0,0,0,0,0,0,0,0,0,0,0,0,0,0,0,"",null,null,null,"","","","","","","","","","","","","","","",""]
[null,102,4,0.54166666666666674,"H.P.",5.2083333333333336E-2,0,0.1875,0,0,0,0,0,0,0.21875,0,0,0,0,8.3333333333333329E-2,0,"ACJN2",null,null,null,"A","","C","","","","","","","J","","","","","N2",""]
[null,103,2,0.45833333333333337,"I.M.E.",0.35416666666666669,0.10416666666666667,0,0,0,0,0,0,0,0,0,0,0,0,0,0,"AB",null,null,null,"A","B","","","","","","","","","","","","","",""]
[null,104,0,0,0,0,0,0,0,0,0,0,0,0,0,0,0,0,0,0,0,"",null,null,null,"","","","","","","","","","","","","","","",""]
[null,105,0,0,"Gendarm. Eybens",0,0,0,0,0,0,0,0,0,0,0,0,0,0,0,0,"",null,null,null,"","","","","","","","","","","","","","","",""]
[null,106,0,0,0,0,0,0,0,0,0,0,0,0,0,0,0,0,0,0,0,"",null,null,null,"","","","","","","","","","","","","","","",""]
[null,107,1,0.14583333333333334,"D.Country",0,0,0,0,0.14583333333333334,0,0,0,0,0,0,0,0,0,0,0,"E",null,null,null,"","","","","E","","","","","","","","","","",""]
[null,108,1,8.3333333333333329E-2,"CE SOPRA",0,0,0,0,0,0,0,0,0,8.3333333333333329E-2,0,0,0,0,0,0,"J",null,null,null,"","","","","","","","","","J","","","","","",""]
[null,109,1,6.25E-2,"ASCE",0,0,0,0,0,0,0,0,0,6.25E-2,0,0,0,0,0,0,"J",null,null,null,"","","","","","","","","","J","","","","","",""]
[null,110,1,0.16666666666666666,"HARMONIE EYBENS",0,0,0,0,0.16666666666666666,0,0,0,0,0,0,0,0,0,0,0,"E",null,null,null,"","","","","E","","","","","","","","","","",""]
[null,111,0,0,0,0,0,0,0,0,0,0,0,0,0,0,0,0,0,0,0,"",null,null,null,"","","","","","","","","","","","","","","",""]
[null,null,0,0,null,0,0,0,0,0,0,0,0,0,0,0,0,0,0,0,0,"",null,null,null,"","","","","","","","","","","","","","","",""]
[null,null,0,0,null,0,0,0,0,0,0,0,0,0,0,0,0,0,0,0,0,"",null,null,null,"","","","","","","","","","","","","","","",""]
[]
[null,null,null,null,null,{"$f":"F4","v":"Salle poly Boulodrm"},{"$f":"G4","v":"Boulodrome"},"Salle Poly RJ ","Salle 2èm\nF Faivre","Préau Bourg","Gym\nR Journet","Salle C\nF Faivre","Salle B\nF Faivre","Salle Muscu\nF Faivre","Stade Compet\n R. Journet","Stade Herbe\n R Journet","Stade C. Piot","Salle de La Tuilerie","Tennis C\ncourt 1","Tennis C\ncourt 2","Salle G; Veymont"]
[null,"1 à 37",{"$f":"SUM(C5:C31)","v":38},{"$f":"SUM(D5:D31)","v":23.833333333333332},"Total utilisat OMS",{"$f":"COUNTIF(F$5:F$31,\">0\")","v":5},{"$f":"COUNTIF(G$5:G$31,\">0\")","v":4},6,2,2,2,2,5,3,1,1,1,1,1,1,1]
[null,"Vérif",">",{"$f":"SUM(F61:U61)","v":23.833333333333339},"Tps Utilisés>",{"$f":"SUM(F5:F31)","v":1.9166666666666667},{"$f":"SUM(G5:G31)","v":2.6458333333333335},1.6458333333333335,0.34375,0.27083333333333331,1.2916666666666667,1.3020833333333335,1.9687500000000002,0.65625000000000011,1.1770833333333333,0.3125,0.78125,0.20833333333333334,3.3541666666666665,3.8541666666666665,2.1041666666666665]
[null,"50 à 59",{"$f":"SUM(C32:C43)","v":17},{"$f":"SUM(D32:D43)","v":5.7395833333333348},"Total Sces Ville",{"$f":"COUNTIF(F$32:F$43,\">0\")","v":2},{"$f":"COUNTIF(G$32:G$43,\">0\")","v":0},1,1,2,3,2,4,2,0,0,0,0,0,0,0]
[null,"Vérif",">",{"$f":"SUM(F63:U63)","v":5.739583333333333},"Temps d'utilisations",{"$f":"SUM(F32:F43)","v":0.20833333333333334},{"$f":"SUM(G32:G43)","v":0},0.5,0.125,1.4583333333333333,1.0833333333333333,0.95833333333333337,1.2291666666666667,0.17708333333333331,0,0,0,0,0,0,0]
[null,"100 à ..",{"$f":"SUM(C44:C57)","v":12},{"$f":"SUM(D44:D58)","v":1.9583333333333333},"Total Autres utilisat.",{"$f":"COUNTIF(F$44:F$57,\">0\")","v":2},{"$f":"COUNTIF(G$44:G$57,\">0\")","v":1},1,1,2,0,1,0,0,3,0,0,0,0,1,0]
[null,"Vérif",">",{"$f":"SUM(F65:U65)","v":1.958333333333333},null,{"$f":"SUM(F44:F56)","v":0.40625},{"$f":"SUM(G44:G56)","v":0.10416666666666667},0.1875,0.25,0.3125,0,0.25,0,0,0.36458333333333331,0,0,0,0,8.3333333333333329E-2,0]
[null,null,{"$f":"C60+C62+C64","v":67},{"$f":"D60+D62+D64","v":31.53125},"Total Général H:M",{"$f":"SUM(F5:F58)","v":2.53125},{"$f":"SUM(G5:G58)","v":2.75},2.3333333333333335,0.71875,2.0416666666666665,2.375,2.510416666666667,3.1979166666666665,0.83333333333333337,1.5416666666666665,0.3125,0.78125,{"$f":"SUM(R5:R58)","v":0.20833333333333334},3.3541666666666665,3.9375,2.1041666666666665]
[null,null,null,{"$f":"SUM(F67:U67)","v":67},"Nbre de photocopies",{"$f":"+F60+F64+F62","v":9},{"$f":"+G60+G64+G62","v":5},8,4,6,5,5,9,5,4,1,1,1,1,2,1]

{"sheet":"Récap OMS Plus","index":20,"n_rows":92,"n_cols":33,"rows_kept":92,"cut":false,"hidden":false,"merged":[[88,32,89,32],[90,27,91,27],[90,28,91,28],[90,29,91,29],[90,30,91,30],[90,31,91,31],[90,32,91,32],[84,31,85,31],[84,32,85,32],[86,27,87,27],[86,28,87,28],[86,29,87,29],[86,30,87,30],[86,31,87,31],[86,32,87,32],[80,31,81,31],[80,32,81,32],[82,27,83,27],[82,28,83,28],[82,29,83,29],[82,30,83,30],[82,31,83,31],[82,32,83,32],[90,26,91,26],[80,27,81,27],[80,28,81,28],[80,29,81,29],[80,30,81,30],[84,27,85,27],[84,28,85,28],[84,29,85,29],[84,30,85,30],[88,27,89,27],[88,28,89,28],[88,29,89,29],[88,30,89,30],[88,26,89,26],[82,26,83,26],[88,31,89,31],[90,12,91,12],[90,13,91,13],[90,14,91,14],[90,15,91,15],[88,22,89,22],[88,23,89,23],[88,24,89,24],[88,25,89,25],[90,21,91,21],[90,22,91,22],[90,23,91,23],[90,24,91,24],[90,25,91,25],[90,16,91,16],[90,17,91,17],[90,18,91,18],[90,19,91,19],[90,20,91,20],[86,26,87,26],[88,9,89,9],[88,10,89,10],[88,11,89,11],[88,12,89,12],[88,13,89,13],[88,14,89,14],[88,15,89,15],[88,16,89,16],[88,17,89,17],[88,18,89,18],[88,19,89,19],[88,20,89,20],[88,21,89,21],[86,20,87,20],[86,21,87,21],[86,22,87,22],[86,23,87,23],[86,24,87,24],[86,17,87,17],[86,18,87,18],[86,19,87,19],[86,16,87,16],[86,25,87,25],[84,9,85,9],[84,10,85,10],[84,11,85,11],[84,12,85,12],[84,13,85,13],[84,14,85,14],[84,15,85,15],[86,9,87,9],[86,10,87,10],[86,11,87,11],[86,12,87,12],[86,13,87,13],[86,14,87,14],[86,15,87,15],[84,26,85,26],[82,12,83,12],[82,13,83,13],[82,14,83,14],[82,15,83,15],[84,16,85,16],[84,17,85,17],[84,18,85,18],[84,19,85,19],[84,20,85,20],[84,21,85,21],[84,22,85,22],[82,21,83,21],[82,22,83,22],[84,23,85,23],[84,24,85,24],[84,25,85,25],[80,22,81,22],[80,23,81,23],[80,24,81,24],[80,25,81,25],[80,26,81,26],[88,8,89,8],[90,8,91,8],[80,9,81,9],[80,10,81,10],[80,11,81,11],[82,9,83,9],[82,10,83,10],[82,11,83,11],[90,9,91,9],[90,10,91,10],[90,11,91,11],[82,23,83,23],[82,24,83,24],[82,25,83,25],[82,16,83,16],[82,17,83,17],[82,18,83,18],[82,19,83,19],[82,20,83,20],[78,32,79,32],[80,8,81,8],[82,8,83,8],[84,8,85,8],[86,8,87,8],[80,12,81,12],[80,13,81,13],[80,14,81,14],[80,15,81,15],[80,16,81,16],[80,17,81,17],[80,18,81,18],[80,19,81,19],[80,20,81,20],[80,21,81,21],[78,27,79,27],[78,28,79,28],[78,29,79,29],[78,30,79,30],[78,31,79,31],[78,22,79,22],[78,23,79,23],[78,24,79,24],[78,25,79,25],[78,26,79,26],[76,32,77,32],[78,8,79,8],[78,9,79,9],[78,10,79,10],[78,11,79,11],[78,12,79,12],[78,13,79,13],[78,14,79,14],[78,15,79,15],[78,16,79,16],[78,17,79,17],[78,18,79,18],[78,19,79,19],[78,20,79,20],[78,21,79,21],[76,27,77,27],[76,28,77,28],[76,29,77,29],[76,30,77,30],[76,31,77,31],[76,22,77,22],[76,23,77,23],[76,24,77,24],[76,25,77,25],[76,26,77,26],[73,32,75,32],[76,8,77,8],[76,9,77,9],[76,10,77,10],[76,11,77,11],[76,12,77,12],[76,13,77,13],[76,14,77,14],[76,15,77,15],[76,16,77,16],[76,17,77,17],[76,18,77,18],[76,19,77,19],[76,20,77,20],[76,21,77,21],[73,27,75,27],[73,28,75,28],[73,29,75,29],[73,30,75,30],[73,31,75,31],[73,22,75,22],[73,23,75,23],[73,24,75,24],[73,25,75,25],[73,26,75,26],[70,32,72,32],[73,8,75,8],[73,9,75,9],[73,10,75,10],[73,11,75,11],[73,12,75,12],[73,13,75,13],[73,14,75,14],[73,15,75,15],[73,16,75,16],[73,17,75,17],[73,18,75,18],[73,19,75,19],[73,20,75,20],[73,21,75,21],[70,27,72,27],[70,28,72,28],[70,30,72,30],[70,31,72,31],[70,22,72,22],[70,23,72,23],[70,24,72,24],[70,25,72,25],[70,26,72,26],[67,32,69,32],[67,30,69,30],[67,31,69,31],[70,8,72,8],[70,9,72,9],[70,10,72,10],[70,11,72,11],[70,12,72,12],[70,13,72,13],[70,14,72,14],[70,15,72,15],[70,16,72,16],[70,17,72,17],[70,18,72,18],[70,19,72,19],[70,20,72,20],[70,21,72,21],[67,27,69,27],[67,28,69,28],[67,29,69,29],[67,22,69,22],[67,23,69,23],[67,24,69,24],[67,25,69,25],[67,26,69,26],[70,29,72,29],[65,32,66,32],[67,8,69,8],[67,9,69,9],[67,10,69,10],[67,11,69,11],[67,12,69,12],[67,13,69,13],[67,14,69,14],[67,15,69,15],[67,16,69,16],[67,17,69,17],[67,18,69,18],[67,19,69,19],[67,20,69,20],[67,21,69,21],[65,27,66,27],[65,28,66,28],[65,29,66,29],[65,30,66,30],[65,31,66,31],[65,22,66,22],[65,23,66,23],[65,24,66,24],[65,25,66,25],[65,26,66,26],[63,32,64,32],[65,8,66,8],[65,9,66,9],[65,10,66,10],[65,11,66,11],[65,12,66,12],[65,13,66,13],[65,14,66,14],[65,15,66,15],[65,16,66,16],[65,17,66,17],[65,18,66,18],[65,19,66,19],[65,20,66,20],[65,21,66,21],[63,27,64,27],[63,28,64,28],[63,29,64,29],[63,30,64,30],[63,31,64,31],[63,22,64,22],[63,23,64,23],[63,24,64,24],[63,25,64,25],[63,26,64,26],[60,32,62,32],[63,8,64,8],[63,9,64,9],[63,10,64,10],[63,11,64,11],[63,12,64,12],[63,13,64,13],[63,14,64,14],[63,15,64,15],[63,16,64,16],[63,17,64,17],[63,18,64,18],[63,19,64,19],[63,20,64,20],[63,21,64,21],[60,27,62,27],[60,28,62,28],[60,29,62,29],[60,30,62,30],[60,31,62,31],[60,22,62,22],[60,23,62,23],[60,24,62,24],[60,25,62,25],[60,26,62,26],[57,32,59,32],[60,8,62,8],[60,9,62,9],[60,10,62,10],[60,11,62,11],[60,12,62,12],[60,13,62,13],[60,14,62,14],[60,15,62,15],[60,16,62,16],[60,17,62,17],[60,18,62,18],[60,19,62,19],[60,20,62,20],[60,21,62,21],[57,27,59,27],[57,28,59,28],[57,30,59,30],[57,31,59,31],[57,22,59,22],[57,23,59,23],[57,24,59,24],[57,25,59,25],[57,26,59,26],[54,32,56,32],[54,30,56,30],[54,31,56,31],[57,8,59,8],[57,9,59,9],[57,10,59,10],[57,11,59,11],[57,12,59,12],[57,13,59,13],[57,14,59,14],[57,15,59,15],[57,16,59,16],[57,17,59,17],[57,18,59,18],[57,19,59,19],[57,20,59,20],[57,21,59,21],[54,27,56,27],[54,28,56,28],[54,29,56,29],[54,22,56,22],[54,23,56,23],[54,24,56,24],[54,25,56,25],[54,26,56,26],[54,17,56,17],[54,18,56,18],[54,19,56,19],[54,20,56,20],[54,21,56,21],[57,29,59,29],[54,13,56,13],[54,14,56,14],[54,15,56,15],[54,16,56,16],[54,10,56,10],[54,8,56,8],[54,9,56,9],[54,11,56,11],[54,12,56,12],[90,0,91,0],[90,1,91,1],[90,2,91,2],[90,5,91,5],[90,7,91,7],[88,0,89,0],[88,1,89,1],[88,2,89,2],[88,5,89,5],[88,7,89,7],[86,0,87,0],[86,1,87,1],[86,2,87,2],[86,5,87,5],[86,7,87,7],[84,0,85,0],[84,1,85,1],[84,2,85,2],[84,5,85,5],[84,7,85,7],[82,0,83,0],[82,1,83,1],[82,2,83,2],[82,5,83,5],[82,7,83,7],[80,0,81,0],[80,1,81,1],[80,2,81,2],[80,5,81,5],[80,7,81,7],[78,0,79,0],[78,1,79,1],[78,2,79,2],[78,5,79,5],[78,7,79,7],[76,0,77,0],[76,1,77,1],[76,2,77,2],[76,5,77,5],[76,7,77,7],[73,0,75,0],[73,1,75,1],[73,2,75,2],[73,5,75,5],[73,7,75,7],[70,0,72,0],[70,1,72,1],[70,2,72,2],[70,5,72,5],[70,7,72,7],[67,0,69,0],[67,1,69,1],[67,2,69,2],[67,5,69,5],[67,7,69,7],[65,0,66,0],[65,1,66,1],[65,2,66,2],[65,5,66,5],[65,7,66,7],[63,0,64,0],[63,1,64,1],[63,2,64,2],[63,5,64,5],[63,7,64,7],[60,0,62,0],[60,1,62,1],[60,2,62,2],[60,5,62,5],[60,7,62,7],[57,0,59,0],[57,1,59,1],[57,2,59,2],[57,5,59,5],[57,7,59,7],[52,4,52,5],[52,6,52,7],[54,0,56,0],[54,1,56,1],[54,2,56,2],[54,5,56,5],[54,7,56,7],[4,0,7,0],[43,1,44,1],[45,1,46,1],[47,1,48,1],[30,2,32,2],[33,2,34,2],[35,2,36,2],[37,2,38,2],[41,2,42,2],[43,2,44,2],[45,2,46,2],[47,2,48,2],[39,2,40,2],[33,1,34,1],[35,1,36,1],[37,1,38,1],[39,1,40,1],[41,1,42,1],[24,1,26,1],[24,2,26,2],[27,1,29,1],[27,2,29,2],[30,1,32,1],[47,0,48,0],[11,1,13,1],[14,1,16,1],[17,1,19,1],[11,2,13,2],[14,2,16,2],[17,2,19,2],[11,7,13,7],[14,7,16,7],[17,7,19,7],[47,5,48,5],[43,7,44,7],[45,7,46,7],[47,7,48,7],[27,7,29,7],[30,7,32,7],[30,5,32,5],[33,5,34,5],[35,5,36,5],[27,5,29,5],[6,5,8,6],[9,4,9,5],[1,5,1,7],[2,5,2,7],[3,5,3,7],[5,5,5,7],[43,5,44,5],[37,7,38,7],[39,7,40,7],[41,7,42,7],[37,5,38,5],[39,5,40,5],[41,5,42,5],[33,7,34,7],[35,7,36,7],[20,7,21,7],[22,7,23,7],[24,7,26,7],[11,5,13,5],[14,5,16,5],[9,6,9,7],[39,0,40,0],[41,0,42,0],[43,0,44,0],[45,0,46,0],[11,0,13,0],[14,0,16,0],[17,0,19,0],[45,5,46,5],[24,5,26,5],[20,1,21,1],[20,2,21,2],[17,5,19,5],[20,5,21,5],[22,5,23,5],[20,0,21,0],[22,0,23,0],[33,0,34,0],[35,0,36,0],[37,0,38,0],[24,0,26,0],[27,0,29,0],[30,0,32,0],[22,2,23,2],[22,1,23,1]]}
[]
[null,{"$f":"SUM(I6:AG6)","v":23.833333333333332},null,null,null,"Clubs >",null,null,{"$f":"INDEX(UTILISATEURS,MATCH(I10,RefUtil,0),2)","v":"OMS"},"J.B.E.","GYM LOISIR","BASKET","CYCLOS","GAULE","JUDO","LUTTE","TENNIS  (2)","CIRQUE (1)","TAI JITSU","G.VOLONTAIRE","DIAGONALE","A.C.E (1)","ESCALADE","ARCHERS","O.C.E","LAI MUOI","TAEKWONDO","E.S.A.G.A.M.I","ALEETT","SPIRIT 38","GMC38EYBENS","PETANQUE","HBC2E"]
[null,null,"Effectifs>",null,null,"Effectifs >",null,null,7,118,517,262,50,136,254,40,173,474,55,169,128,372,78,138,665,21,55,92,212,152,66,66,326]
[null,null,null,null,null,"Temps/Effectif >",null,null,{"$f":"I6/I3","v":1.7857142857142856E-2},1.0151836158192089E-2,1.893939393939394E-3,8.786577608142495E-3,1.6666666666666666E-3,0,3.8959973753280837E-3,4.1666666666666666E-3,4.1666666666666664E-2,4.4391701828410688E-3,7.1969696969696973E-3,4.0064102564102569E-3,1.6276041666666667E-3,0,7.4786324786324781E-3,4.6044685990338169E-3,3.4147869674185458E-3,7.9365079365079378E-3,7.575757575757576E-3,5.434782608695652E-3,2.3584905660377358E-3,3.3580043859649127E-3,0,8.8383838383838398E-3,3.7704498977505106E-3]
["Matrices",null,null,null,"Tot Géneral"]
[null,null,null,null,{"$f":"SUM(I6:AG6)","v":23.833333333333332},"Temps Hebdo/ Club :",null,null,{"$f":"SUM(I12:I49)","v":0.125},{"$f":"SUM(J12:J49)","v":1.1979166666666665},0.97916666666666674,2.3020833333333335,8.3333333333333329E-2,0,0.98958333333333326,0.16666666666666666,7.208333333333333,2.1041666666666665,0.39583333333333337,0.67708333333333337,0.20833333333333334,0,0.58333333333333326,0.63541666666666674,2.270833333333333,0.16666666666666669,0.41666666666666669,0.5,0.5,0.51041666666666674,0,0.58333333333333337,1.2291666666666665]
[null,null,null,null,{"$f":"SUM(I7:AG7)","v":10.281250000000002},"Détail par niveau",null,1,{"$f":"SUMPRODUCT(($D$12:$D$49=$H7)*(I$12:I$49))","v":0},{"$f":"SUMPRODUCT(($D$12:$D$49=$H7)*(J$12:J$49))","v":0.65625},{"$f":"SUMPRODUCT(($D$12:$D$49=$H7)*(K$12:K$49))","v":0.44791666666666663},{"$f":"SUMPRODUCT(($D$12:$D$49=$H7)*(L$12:L$49))","v":0.40625},{"$f":"SUMPRODUCT(($D$12:$D$49=$H7)*(M$12:M$49))","v":6.25E-2},0,0.21875,0,5.5833333333333339,1.3020833333333333,0.14583333333333334,0.11458333333333333,6.25E-2,0,3.125E-2,0.10416666666666667,0.5,0,2.0833333333333332E-2,0,{"$f":"SUMPRODUCT(($D$12:$D$49=$H7)*(AC$12:AC$49))","v":6.25E-2},6.25E-2,0,0.375,0.125]
[null,null,null,null,8.03125,null,null,2,{"$f":"SUMPRODUCT(($D$12:$D$49=$H8)*(I$12:I$49))","v":0.125},0.10416666666666667,0.29166666666666669,0.83333333333333326,2.0833333333333332E-2,0,0.33333333333333331,4.1666666666666664E-2,1.625,0.80208333333333337,0.10416666666666667,0.4375,0.14583333333333334,0,0.1875,0.1875,1.770833333333333,6.25E-2,0.25,2.0833333333333332E-2,0.16666666666666666,0.10416666666666667,0,4.1666666666666664E-2,0.375]
[null,null,null,null,5.5208333333333339,null,null,3,0,0.4375,0.23958333333333331,1.0625,0,0,0.4375,0.125,0,0,0.14583333333333334,0.125,0,0,0.36458333333333331,0.34375,0,0.10416666666666667,0.14583333333333334,0.47916666666666663,0.27083333333333331,0.34375,0,0.16666666666666666,0.72916666666666663]
[null,null,null,null,"VIDE",null,"UTILISÉ",null,1,3,4,5,7,9,10,11,15,16,17,19,20,21,23,24,27,28,30,31,32,34,35,36,37]
[null,"Ref Équipmt","Equipement","Niveau","s/total","Tot.Vide","s/total","Tot.Utilisé",{"$f":"INDEX(UTILISATEURS,MATCH(I10,RefUtil,0),2)","v":"OMS"},{"$f":"INDEX(UTILISATEURS,MATCH(J10,RefUtil,0),2)","v":"J.B.E."},"GYM LOISIR","BASKET","CYCLOS","GAULE","JUDO","LUTTE","TENNIS  (2)","CIRQUE (1)","TAI JITSU","G.VOLONTAIRE","DIAGONALE","A.C.E (1)","ESCALADE","ARCHERS","O.C.E","LAI MUOI","TAEKWONDO","E.S.A.G.A.M.I","ALEETT","SPIRIT 38","GMC38EYBENS","PETANQUE","HBC2E"]
["3 Nivx Sans Scol","A","Salle Polyvalente  Boulodrome",1,{"$f":"SUMPRODUCT((A_Plage=\"V\")*(MATRICE_3_Sans=$D12))*15/1440","v":0.5},{"$f":"SUMPRODUCT((A_Plage=\"v\")*15/1440)","v":0.82291666666666585},{"$f":"SUM(I12:AG12)","v":0.44791666666666663},{"$f":"SUM(G12:G14)","v":1.9166666666666665},{"$f":"SUMPRODUCT((A_Plage=I$10)*(MATRICE_3_Sans=$D12))*15/1440","v":0},0,8.3333333333333329E-2,0,0,0,0.21875,0,0,{"$f":"SUMPRODUCT((A_Plage=R$10)*(MATRICE_3_Sans=$D12))*15/1440","v":0},0.14583333333333334,0,0,0,0,0,0,0,0,{"$f":"SUMPRODUCT((A_Plage=AB$10)*(MATRICE_3_Sans=$D12))*15/1440","v":0},0,0,0,0,0]
[null,null,null,2,{"$f":"SUMPRODUCT((A_Plage=\"V\")*(MATRICE_3_Sans=$D13))*15/1440","v":0.28125},null,0.73958333333333326,null,0,0,5.2083333333333336E-2,0,0,0,0.33333333333333331,0,0,0,0.10416666666666667,0.25,0,0,0,0,0,0,0,0,0,0,0,0,0]
[null,null,null,3,{"$f":"SUMPRODUCT((A_Plage=\"V\")*(MATRICE_3_Sans=$D14))*15/1440","v":4.1666666666666664E-2},null,0.72916666666666663,null,0,0,0,0,0,0,0.4375,0,0,0,0.14583333333333334,4.1666666666666664E-2,0,0,0,0,0,0,0.10416666666666667,0,0,0,0,0,0]
["3 Nivx Avec Scol","B","Boulodrome",1,{"$f":"SUMPRODUCT((B_plage=\"v\")*(MATRICE_3_Avec=$D15))*15/1440","v":0.5625},{"$f":"SUMPRODUCT((B_plage=\"v\")*15/1440)","v":1.0520833333333321},1.1354166666666665,{"$f":"SUM(G15:G17)","v":2.645833333333333},{"$f":"SUMPRODUCT((B_plage=I$10)*(MATRICE_3_Avec=$D15))*15/1440","v":0},0.65625,0,0,0,0,0,0,{"$f":"SUMPRODUCT((B_plage=Q$10)*(MATRICE_3_Avec=$D15))*15/1440","v":0},0,0,0,0,0,0,0.10416666666666667,0,0,{"$f":"SUMPRODUCT((B_plage=AA$10)*(MATRICE_3_Avec=$D15))*15/1440","v":0},0,0,0,0,0.375,0]
[null,null,null,2,{"$f":"SUMPRODUCT((B_plage=\"v\")*(MATRICE_3_Avec=$D16))*15/1440","v":0.41666666666666669},null,0.35416666666666669,null,0,0.10416666666666667,0,0,0,0,0,0,0,0,0,0,0,0,0,0.1875,0,0,0,2.0833333333333332E-2,0,0,0,4.1666666666666664E-2,0]
[null,null,null,3,{"$f":"SUMPRODUCT((B_plage=\"v\")*(MATRICE_3_Avec=$D17))*15/1440","v":7.2916666666666671E-2},null,1.15625,null,0,0.4375,0,0,0,0,0,0,0,0,0,0,0,0,0,0.34375,0,0,0,0.20833333333333334,0,0,0,0.16666666666666666,0]
["3 Nivx Avec Scol","C","Salle Polyvalente Roger Journet ",1,{"$f":"SUMPRODUCT((C_plage=\"v\")*(MATRICE_3_Avec=$D18))*15/1440","v":0.33333333333333331},{"$f":"SUMPRODUCT((C_plage=\"v\")*15/1440)","v":0.65624999999999978},0.48958333333333331,{"$f":"SUM(G18:G20)","v":1.6458333333333333},{"$f":"SUMPRODUCT((C_plage=I$10)*(MATRICE_3_Avec=$D18))*15/1440","v":0},0,0.33333333333333331,0,0,0,0,0,0,{"$f":"SUMPRODUCT((C_plage=R$10)*(MATRICE_3_Avec=$D18))*15/1440","v":0},0,9.375E-2,0,0,0,0,0,0,0,{"$f":"SUMPRODUCT((C_plage=AB$10)*(MATRICE_3_Avec=$D18))*15/1440","v":0},0,6.25E-2,0,0,0]
[null,null,null,2,{"$f":"SUMPRODUCT((C_plage=\"V\")*(MATRICE_3_Avec=$D19))*15/1440","v":0.28125},null,0.30208333333333331,null,0,0,0,0,0,0,0,4.1666666666666664E-2,0,0,0,3.125E-2,0,0,0,0,0,6.25E-2,6.25E-2,0,0,0.10416666666666667,0,0,0]
[null,null,null,3,{"$f":"SUMPRODUCT((C_plage=\"v\")*(MATRICE_3_Avec=$D20))*15/1440","v":4.1666666666666664E-2},null,0.85416666666666663,null,0,0,0.15625,0,0,0,0,0.125,0,0,0,8.3333333333333329E-2,0,0,0,0,0,0.10416666666666667,4.1666666666666664E-2,0,0,0.34375,0,0,0]
["2 Niveaux","D","Salle 2èm\nF Faivre",1,{"$f":"SUMPRODUCT((D_plage=\"v\")*(MATRICE_2=$D21))*15/1440","v":2.2291666666666665},{"$f":"SUMPRODUCT((D_plage=\"v\")*15/1440)","v":2.656249999999996},4.1666666666666664E-2,{"$f":"SUM(G21:G22)","v":0.34375},{"$f":"SUMPRODUCT((D_plage=I$10)*(MATRICE_2=$D21))*15/1440","v":0},0,0,0,0,0,0,0,0,{"$f":"SUMPRODUCT((D_plage=R$10)*(MATRICE_2=$D21))*15/1440","v":0},0,2.0833333333333332E-2,0,0,0,0,0,0,2.0833333333333332E-2,{"$f":"SUMPRODUCT((D_plage=AB$10)*(MATRICE_2=$D21))*15/1440","v":0},0,0,0,0,0]
[null,null,null,2,{"$f":"SUMPRODUCT((D_plage=\"v\")*(MATRICE_2=$D22))*15/1440","v":0.42708333333333331},null,0.30208333333333331,null,0,0,0,0,0,0,0,0,0,0,0,0.11458333333333333,0,0,0,0,0,0,0.1875,0,0,0,0,0,0]
["2 Niveaux","E","Préau Bourg",1,{"$f":"SUMPRODUCT((E_plage=\"v\")*(MATRICE_3_Avec=$D23))*15/1440","v":0.22916666666666666},{"$f":"SUMPRODUCT((E_plage=\"v\")*15/1440)","v":0.7708333333333327},2.0833333333333332E-2,{"$f":"SUM(G23:G24)","v":0.27083333333333331},{"$f":"SUMPRODUCT((E_plage=I$10)*(MATRICE_2=$D23))*15/1440","v":0},0,2.0833333333333332E-2,0,0,0,0,0,0,{"$f":"SUMPRODUCT((E_plage=R$10)*(MATRICE_2=$D23))*15/1440","v":0},0,0,0,0,0,0,0,0,0,{"$f":"SUMPRODUCT((E_plage=AB$10)*(MATRICE_2=$D23))*15/1440","v":0},0,0,0,0,0]
[null,null,null,2,{"$f":"SUMPRODUCT((E_plage=\"v\")*(MATRICE_3_Avec=$D24))*15/1440","v":0.22916666666666666},null,0.25,null,0,0,0.20833333333333334,0,0,0,0,0,0,0,0,4.1666666666666664E-2,0,0,0,0,0,0,0,0,0,0,0,0,0]
["3 Nivx Avec Scol","F","Gym\nR Journet",1,{"$f":"SUMPRODUCT((F_plage=\"v\")*(MATRICE_3_Avec=$D25))*15/1440","v":0.64583333333333337},{"$f":"SUMPRODUCT((F_plage=\"v\")*15/1440)","v":0.99999999999999856},0.125,{"$f":"SUM(G25:G27)","v":1.2916666666666665},{"$f":"SUMPRODUCT((F_plage=I$10)*(MATRICE_3_Avec=$D25))*15/1440","v":0},0,0,0,0,0,0,0,{"$f":"SUMPRODUCT((F_plage=Q$10)*(MATRICE_3_Avec=$D25))*15/1440","v":0},0,0,0,0,0,0,0,0,0,{"$f":"SUMPRODUCT((F_plage=AA$10)*(MATRICE_3_Avec=$D25))*15/1440","v":0},0,0,0,0,0,0.125]
[null,null,null,2,{"$f":"SUMPRODUCT((F_plage=\"v\")*(MATRICE_3_Avec=$D26))*15/1440","v":0.25},null,0.375,null,0,0,0,0,0,0,0,0,0,0,0,0,0,0,0,0,0,0,0,0,0,0,0,0,0.375]
[null,null,null,3,{"$f":"SUMPRODUCT((F_plage=\"v\")*(MATRICE_3_Avec=$D27))*15/1440","v":0.10416666666666667},null,0.79166666666666663,null,0,0,0,6.25E-2,0,0,0,0,0,0,0,0,0,0,0,0,0,0,0,0,0,0,0,0,0.72916666666666663]
["3 Nivx Avec Scol","G","Salle C\nF Faivre",1,{"$f":"SUMPRODUCT((G_plage=\"v\")*(MATRICE_3_Avec=$D28))*15/1440","v":0.21875},{"$f":"SUMPRODUCT((G_plage=\"v\")*15/1440)","v":0.46875000000000028},0.16666666666666666,{"$f":"SUM(G28:G30)","v":1.3020833333333335},{"$f":"SUMPRODUCT((G_plage=I$10)*(MATRICE_3_Avec=$D28))*15/1440","v":0},0,0,0.16666666666666666,0,0,0,0,{"$f":"SUMPRODUCT((G_plage=Q$10)*(MATRICE_3_Avec=$D28))*15/1440","v":0},0,0,0,0,0,0,0,0,0,{"$f":"SUMPRODUCT((G_plage=AA$10)*(MATRICE_3_Avec=$D28))*15/1440","v":0},0,0,0,0,0,0]
[null,null,null,2,{"$f":"SUMPRODUCT((G_plage=\"v\")*(MATRICE_3_Avec=$D29))*15/1440","v":0.21875},null,0.35416666666666669,null,0,0,0,0.35416666666666669,0,0,0,0,0,0,0,0,0,0,0,0,0,0,0,0,0,0,0,0,0]
[null,null,null,3,{"$f":"SUMPRODUCT((G_plage=\"v\")*(MATRICE_3_Avec=$D30))*15/1440","v":3.125E-2},null,0.78125,null,0,0,0,0.64583333333333337,0,0,0,0,0,0,0,0,0,0,0,0,0,0,0,0.13541666666666666,0,0,0,0,0]
["3 Nivx Avec Scol","H","Salle B\nF Faivre",1,{"$f":"SUMPRODUCT((H_plage=\"v\")*(MATRICE_3_Avec=$D31))*15/1440","v":0.20833333333333334},{"$f":"SUMPRODUCT((H_plage=\"v\")*15/1440)","v":0.47916666666666696},0.16666666666666669,{"$f":"SUM(G31:G33)","v":1.96875},{"$f":"SUMPRODUCT((H_plage=I$10)*(MATRICE_3_Avec=$D31))*15/1440","v":0},0,1.0416666666666666E-2,6.25E-2,0,0,0,0,{"$f":"SUMPRODUCT((H_plage=Q$10)*(MATRICE_3_Avec=$D31))*15/1440","v":0},0,0,0,0,0,3.125E-2,0,0,0,{"$f":"SUMPRODUCT((H_plage=AA$10)*(MATRICE_3_Avec=$D31))*15/1440","v":0},0,6.25E-2,0,0,0,0]
[null,null,null,2,{"$f":"SUMPRODUCT((H_plage=\"v\")*(MATRICE_3_Avec=$D32))*15/1440","v":0.16666666666666666},null,0.59375,null,0,0,3.125E-2,0.20833333333333334,0,0,0,0,0,0,0,0,0,0,0.1875,0,0,0,0,0,0.16666666666666666,0,0,0,0]
[null,null,null,3,{"$f":"SUMPRODUCT((H_plage=\"v\")*(MATRICE_3_Avec=$D33))*15/1440","v":0.10416666666666667},null,1.2083333333333333,null,0,0,8.3333333333333329E-2,0.35416666666666669,0,0,0,0,0,0,0,0,0,0,0.36458333333333331,0,0,0,0,0.13541666666666666,0.27083333333333331,0,0,0,0]
["2 Niveaux","I","Salle Muscu\nF Faivre",1,{"$f":"SUMPRODUCT((I_plage=\"v\")*(MATRICE_2=$D34))*15/1440","v":1.7708333333333333},{"$f":"SUMPRODUCT((I_plage=\"v\")*15/1440)","v":1.9791666666666721},0.23958333333333334,{"$f":"SUM(G34:G35)","v":0.65625},{"$f":"SUMPRODUCT((I_plage=I$10)*(MATRICE_2=$D34))*15/1440","v":0},0,0,0.17708333333333334,6.25E-2,0,0,0,{"$f":"SUMPRODUCT((I_plage=Q$10)*(MATRICE_2=$D34))*15/1440","v":0},0,0,0,0,0,0,0,0,0,{"$f":"SUMPRODUCT((I_plage=AA$10)*(MATRICE_2=$D34))*15/1440","v":0},0,0,0,0,0,0]
[null,null,null,2,{"$f":"SUMPRODUCT((I_plage=\"v\")*(MATRICE_2=$D35))*15/1440","v":0.20833333333333334},null,0.41666666666666663,null,0.125,0,0,0.27083333333333331,2.0833333333333332E-2,0,0,0,0,0,0,0,0,0,0,0,0,0,0,0,0,0,0,0,0]
["2 Niveaux","J","Stade Synthé\nR Journet",1,{"$f":"SUMPRODUCT((J_plage=\"v\")*(MATRICE_2=$D36))*15/1440","v":1.4166666666666667},{"$f":"SUMPRODUCT((J_plage=\"v\")*15/1440)","v":1.4166666666666681},0.38541666666666669,{"$f":"SUM(G36:G37)","v":1.1770833333333333},{"$f":"SUMPRODUCT((J_plage=I$10)*(MATRICE_2=$D36))*15/1440","v":0},0,0,0,0,0,0,0,{"$f":"SUMPRODUCT((J_plage=Q$10)*(MATRICE_2=$D36))*15/1440","v":0},0,0,0,0,0,0,0,0.38541666666666669,0,{"$f":"SUMPRODUCT((J_plage=AA$10)*(MATRICE_2=$D36))*15/1440","v":0},0,0,0,0,0,0]
[null,null,null,2,{"$f":"SUMPRODUCT((J_plage=\"v\")*(MATRICE_2=$D37))*15/1440","v":0},null,0.79166666666666663,null,0,0,0,0,0,0,0,0,0,0,0,0,0,0,0,0,0.79166666666666663,0,0,0,0,0,0,0,0]
["2 Niveaux","K","Stade Herbe\nR Journet",1,{"$f":"SUMPRODUCT((K_plage=\"v\")*(MATRICE_2=$D38))*15/1440","v":0},{"$f":"SUMPRODUCT((K_plage=\"v\")*15/1440)","v":2.0833333333333332E-2},{"$f":"SUM(I38:AG38)","v":0},{"$f":"SUM(G38:G39)","v":0.3125},{"$f":"SUMPRODUCT((K_plage=I$10)*(MATRICE_2=$D38))*15/1440","v":0},0,0,0,0,0,0,0,{"$f":"SUMPRODUCT((K_plage=Q$10)*(MATRICE_2=$D38))*15/1440","v":0},0,0,0,0,0,0,0,0,0,{"$f":"SUMPRODUCT((K_plage=AA$10)*(MATRICE_2=$D38))*15/1440","v":0},0,0,0,0,0,0]
[null,null,null,2,{"$f":"SUMPRODUCT((K_plage=\"v\")*(MATRICE_2=$D39))*15/1440","v":2.0833333333333332E-2},null,{"$f":"SUM(I39:AG39)","v":0.3125},null,0,0,0,0,0,0,0,0,0,0,0,0,0,0,0,0,0.3125,0,0,0,0,0,0,0,0]
["2 Niveaux","L","Stade C. Piot",1,{"$f":"SUMPRODUCT((L_plage=\"v\")*(MATRICE_2=$D40))*15/1440","v":0},{"$f":"SUMPRODUCT((L_plage=\"v\")*15/1440)","v":0},{"$f":"SUM(I40:AG40)","v":0.11458333333333333},{"$f":"SUM(G40:G41)","v":0.78125},{"$f":"SUMPRODUCT((L_plage=I$10)*(MATRICE_2=$D40))*15/1440","v":0},0,0,0,0,0,0,0,{"$f":"SUMPRODUCT((L_plage=Q$10)*(MATRICE_2=$D40))*15/1440","v":0},0,0,0,0,0,0,0,0.11458333333333333,0,{"$f":"SUMPRODUCT((L_plage=AA$10)*(MATRICE_2=$D40))*15/1440","v":0},0,0,0,0,0,0]
[null,null,null,2,{"$f":"SUMPRODUCT((L_plage=\"v\")*(MATRICE_2=$D41))*15/1440","v":0},null,{"$f":"SUM(I41:AG41)","v":0.66666666666666663},null,0,0,0,0,0,0,0,0,0,0,0,0,0,0,0,0,0.66666666666666663,0,0,0,0,0,0,0,0]
["2 Niveaux","M","Stade Herbe\nR Journet",1,{"$f":"SUMPRODUCT((M_plage=\"v\")*(MATRICE_2=$D42))*15/1440","v":0},{"$f":"SUMPRODUCT((M_plage=\"v\")*15/1440)","v":0},{"$f":"SUM(I42:AG42)","v":6.25E-2},{"$f":"SUM(G42:G43)","v":0.20833333333333334},{"$f":"SUMPRODUCT((M_plage=I$10)*(MATRICE_2=$D42))*15/1440","v":0},0,0,0,0,0,0,0,{"$f":"SUMPRODUCT((M_plage=Q$10)*(MATRICE_2=$D42))*15/1440","v":0},0,0,0,6.25E-2,0,0,0,0,0,{"$f":"SUMPRODUCT((M_plage=AA$10)*(MATRICE_2=$D42))*15/1440","v":0},0,0,0,0,0,0]
[null,null,null,2,{"$f":"SUMPRODUCT((M_plage=\"v\")*(MATRICE_2=$D43))*15/1440","v":0},null,{"$f":"SUM(I43:AG43)","v":0.14583333333333334},null,0,0,0,0,0,0,0,0,0,0,0,0,0.14583333333333334,0,0,0,0,0,0,0,0,0,0,0,0]
["2 Niveaux","N1","Tennis C \nCourt N°1",1,{"$f":"SUMPRODUCT((N1_plage=\"v\")*(MATRICE_2=$D44))*15/1440","v":0.20833333333333334},{"$f":"SUMPRODUCT((N1_plage=\"v\")*15/1440)","v":0.20833333333333326},{"$f":"SUM(I44:AG44)","v":2.5625},{"$f":"SUM(G44:G45)","v":3.3541666666666665},{"$f":"SUMPRODUCT((N1_plage=I$10)*(MATRICE_2=$D44))*15/1440","v":0},0,0,0,0,0,0,0,{"$f":"SUMPRODUCT((N1_plage=Q$10)*(MATRICE_2=$D44))*15/1440","v":2.5625},0,0,0,0,0,0,0,0,0,{"$f":"SUMPRODUCT((N1_plage=AA$10)*(MATRICE_2=$D44))*15/1440","v":0},0,0,0,0,0,0]
[null,null,null,2,{"$f":"SUMPRODUCT((N1_plage=\"v\")*(MATRICE_2=$D45))*15/1440","v":0},null,{"$f":"SUM(I45:AG45)","v":0.79166666666666663},null,0,0,0,0,0,0,0,0,0.79166666666666663,0,0,0,0,0,0,0,0,0,0,0,0,0,0,0,0]
["2 Niveaux","N2","Tennis C \nCourt N°2",1,{"$f":"SUMPRODUCT((N2_plage=\"v\")*(MATRICE_2=$D46))*15/1440","v":0},{"$f":"SUMPRODUCT((N2_plage=\"v\")*15/1440)","v":0},{"$f":"SUM(I46:AG46)","v":3.0208333333333335},{"$f":"SUM(G46:G47)","v":3.854166666666667},{"$f":"SUMPRODUCT((N2_plage=I$10)*(MATRICE_2=$D46))*15/1440","v":0},0,0,0,0,0,0,0,{"$f":"SUMPRODUCT((N2_plage=Q$10)*(MATRICE_2=$D46))*15/1440","v":3.0208333333333335},0,0,0,0,0,0,0,0,0,{"$f":"SUMPRODUCT((N2_plage=AA$10)*(MATRICE_2=$D46))*15/1440","v":0},0,0,0,0,0,0]
[null,null,null,2,{"$f":"SUMPRODUCT((N2_plage=\"v\")*(MATRICE_2=$D47))*15/1440","v":0},null,{"$f":"SUM(I47:AG47)","v":0.83333333333333337},null,0,0,0,0,0,0,0,0,0.83333333333333337,0,0,0,0,0,0,0,0,0,0,0,0,0,0,0,0]
["2 Niveaux","O","Salle G; Veymont",1,{"$f":"SUMPRODUCT((P_plage=\"v\")*(MATRICE_2=$D48))*15/1440","v":1.09375},{"$f":"SUMPRODUCT((P_plage=\"v\")*15/1440)","v":1.1249999999999993},{"$f":"SUM(I48:AG48)","v":1.3020833333333333},{"$f":"SUM(G48:G49)","v":2.1041666666666665},{"$f":"SUMPRODUCT((P_plage=I$10)*(MATRICE_2=$D48))*15/1440","v":0},0,0,0,0,0,0,0,{"$f":"SUMPRODUCT((P_plage=Q$10)*(MATRICE_2=$D48))*15/1440","v":0},1.3020833333333333,0,0,0,0,0,0,0,0,{"$f":"SUMPRODUCT((P_plage=AA$10)*(MATRICE_2=$D48))*15/1440","v":0},0,0,0,0,0,0]
[null,null,null,2,{"$f":"SUMPRODUCT((P_plage=\"v\")*(MATRICE_2=$D49))*15/1440","v":3.125E-2},null,{"$f":"SUM(I49:AG49)","v":0.80208333333333337},null,0,0,0,0,0,0,0,0,0,0.80208333333333337,0,0,0,0,0,0,0,0,0,0,0,0,0,0,0]
[]
[]
[]
[null,null,null,null,"VIDE",null,"UTILISÉ",null,1,3,4,5,7,9,10,11,15,16,17,19,20,21,23,24,27,28,30,31,32,33,34,35,36]
[null,"Ref Équipmt","Equipement","Niveau","s/total","Tot.Vide","s/total","Tot.Utilisé",{"$f":"INDEX(UTILISATEURS,MATCH(I53,RefUtil,0),2)","v":"OMS"},{"$f":"INDEX(UTILISATEURS,MATCH(J53,RefUtil,0),2)","v":"J.B.E."},"GYM LOISIR","BASKET","CYCLOS","GAULE","JUDO","LUTTE","TENNIS  (2)","CIRQUE (1)","TAI JITSU","G.VOLONTAIRE","DIAGONALE","A.C.E (1)","ESCALADE","ARCHERS","O.C.E","LAI MUOI","TAEKWONDO","E.S.A.G.A.M.I","ALEETT",{"$error":"#N/A"},"SPIRIT 38","GMC38EYBENS","PETANQUE"]
["3 Nivx Sans Scol","A","Salle poly Boulodrm",1,{"$f":"+E12","v":0.5},{"$f":"SUMPRODUCT((A_Plage=\"v\")*15/1440)","v":0.82291666666666585},{"$f":"+G12","v":0.44791666666666663},{"$f":"+H12","v":1.9166666666666665},{"$f":"SUM(I12:I14)/TOTA","v":0},0,7.0652173913043473E-2,0,0,0,0.51630434782608692,0,0,0,0.20652173913043481,0.15217391304347827,0,0,0,0,0,0,5.4347826086956527E-2,0,0,0,0,0,0]
[null,null,null,2,{"$f":"+E13","v":0.28125},null,{"$f":"+G13","v":0.73958333333333326}]
[null,null,null,3,{"$f":"+E14","v":4.1666666666666664E-2},null,0.72916666666666663]
["3 Nivx Avec Scol","B","Boulodrome",1,{"$f":"+E15","v":0.5625},{"$f":"SUMPRODUCT((B_plage=\"v\")*15/1440)","v":1.0520833333333321},1.1354166666666665,{"$f":"+H15","v":2.645833333333333},{"$f":"SUM(I15:I17)/TOTB","v":0},0.452755905511811,0,0,0,0,0,0,0,0,0,0,0,0,0,0.24015748031496068,0,0,0,8.6614173228346469E-2,0,0,0,0.22047244094488194,0]
[null,null,null,2,{"$f":"+E16","v":0.41666666666666669},null,0.35416666666666669]
[null,null,null,3,{"$f":"+E17","v":7.2916666666666671E-2},null,1.15625]
["3 Nivx Avec Scol","C","Salle Poly Roger Journet ",1,{"$f":"+E18","v":0.33333333333333331},{"$f":"SUMPRODUCT((C_plage=\"v\")*15/1440)","v":0.65624999999999978},0.48958333333333331,{"$f":"H18","v":1.6458333333333333},{"$f":"SUM(I18:I20)/TOTC","v":0},0,0.29746835443037972,0,0,0,0,0.10126582278481013,0,0,0,0.12658227848101264,0,0,0,0,0,0.10126582278481014,6.3291139240506319E-2,0,0,0.31012658227848106,0,0,0]
[null,null,null,2,{"$f":"+E19","v":0.28125},null,0.30208333333333331]
[null,null,null,3,{"$f":"+E20","v":4.1666666666666664E-2},null,0.85416666666666663]
["2 Niveaux","D","Salle 2èm\nF Faivre",1,{"$f":"+E21","v":2.2291666666666665},{"$f":"SUMPRODUCT((D_plage=\"v\")*15/1440)","v":2.656249999999996},4.1666666666666664E-2,{"$f":"+H21","v":0.34375},{"$f":"SUM(I21:I22)/TOTD","v":0},0,0,0,0,0,0,0,0,0,0,0.39393939393939392,0,0,0,0,0,0,0.60606060606060608,0,0,0,0,0,0]
[null,null,null,2,{"$f":"+E22","v":0.42708333333333331},null,0.30208333333333331]
["2 Niveaux","E","Préau Bourg",1,{"$f":"+E23","v":0.22916666666666666},{"$f":"SUMPRODUCT((E_plage=\"v\")*15/1440)","v":0.7708333333333327},2.0833333333333332E-2,{"$f":"H23","v":0.27083333333333331},{"$f":"SUM(I23:I24)/TOTE","v":0},0,0.84615384615384626,0,0,0,0,0,0,0,0,0.15384615384615385,0,0,0,0,0,0,0,0,0,0,0,0,0]
[null,null,null,2,{"$f":"+E24","v":0.22916666666666666},null,0.25]
["3 Nivx Avec Scol","F","Gym\nR Journet",1,{"$f":"+E25","v":0.64583333333333337},{"$f":"SUMPRODUCT((F_plage=\"v\")*15/1440)","v":0.99999999999999856},0.125,{"$f":"H25","v":1.2916666666666665},{"$f":"SUM(I25:I27)/TOTF","v":0},0,0,4.8387096774193554E-2,0,0,0,0,0,0,0,0,0,0,0,0,0,0,0,0,0,0,0,0,0.95161290322580649]
[null,null,null,2,{"$f":"+E26","v":0.25},null,0.375]
[null,null,null,3,{"$f":"+E27","v":0.10416666666666667},null,0.79166666666666663]
["3 Nivx Avec Scol","G","Salle C\nF Faivre",1,{"$f":"+E28","v":0.21875},{"$f":"SUMPRODUCT((G_plage=\"v\")*15/1440)","v":0.46875000000000028},0.16666666666666666,{"$f":"H28","v":1.3020833333333335},{"$f":"SUM(I28:I30)/TOTG","v":0},0,0,0.89599999999999991,0,0,0,0,0,0,0,0,0,0,0,0,0,0,0,0.10399999999999998,0,0,0,0,0]
[null,null,null,2,{"$f":"+E29","v":0.21875},null,0.35416666666666669]
[null,null,null,3,{"$f":"+E30","v":3.125E-2},null,0.78125]
["3 Nivx Avec Scol","H","Salle B\nF Faivre",1,{"$f":"+E31","v":0.20833333333333334},{"$f":"SUMPRODUCT((H_plage=\"v\")*15/1440)","v":0.47916666666666696},0.16666666666666669,{"$f":"H31","v":1.96875},{"$f":"SUM(I31:I33)/TOTH","v":0},0,6.3492063492063489E-2,0.31746031746031744,0,0,0,0,0,0,0,0,0,0,0.29629629629629628,0,0,0,0,6.8783068783068779E-2,0.25396825396825395,0,0,0,0]
[null,null,null,2,{"$f":"+E32","v":0.16666666666666666},null,0.59375]
[null,null,null,3,{"$f":"+E33","v":0.10416666666666667},null,1.2083333333333333]
["2 Niveaux","I","Salle Muscu\nF Faivre",1,{"$f":"+E34","v":1.7708333333333333},{"$f":"SUMPRODUCT((I_plage=\"v\")*15/1440)","v":1.9791666666666721},0.23958333333333334,{"$f":"H34","v":0.65625},{"$f":"SUM(I34:I35)/TOTI","v":0.19047619047619047},0,0,0.68253968253968245,0.12698412698412698,0,0,0,0,0,0,0,0,0,0,0,0,0,0,0,0,0,0,0,0]
[null,null,null,2,{"$f":"+E35","v":0.20833333333333334},null,0.41666666666666663]
["2 Niveaux","J","Stade Synthé\nR Journet",1,{"$f":"+E36","v":1.4166666666666667},{"$f":"SUMPRODUCT((J_plage=\"v\")*15/1440)","v":1.4166666666666681},0.38541666666666669,{"$f":"H36","v":1.1770833333333333},{"$f":"SUM(I36:I37)/TOTJ","v":0},0,0,0,0,0,0,0,0,0,0,0,0,0,0,0,1,0,0,0,0,0,0,0,0]
[null,null,null,2,{"$f":"+E37","v":0},null,0.79166666666666663]
["2 Niveaux","K","Stade Herbe\nR Journet",1,{"$f":"+E38","v":0},{"$f":"SUMPRODUCT((K_plage=\"v\")*15/1440)","v":2.0833333333333332E-2},0,{"$f":"H38","v":0.3125},{"$f":"SUM(I38:I39)/TOTK","v":0},0,0,0,0,0,0,0,0,0,0,0,0,0,0,0,1,0,0,0,0,0,0,0,0]
[null,null,null,2,{"$f":"+E39","v":2.0833333333333332E-2},null,0.3125]
["2 Niveaux","L","Stade C. Piot",1,{"$f":"+E40","v":0},{"$f":"SUMPRODUCT((L_plage=\"v\")*15/1440)","v":0},0.11458333333333333,{"$f":"H40","v":0.78125},{"$f":"SUM(I40:I41)/TOTL","v":0},0,0,0,0,0,0,0,0,0,0,0,0,0,0,0,1,0,0,0,0,0,0,0,0]
[null,null,null,2,{"$f":"+E41","v":0},null,0.66666666666666663]
["2 Niveaux","M","Salle Tuilerie",1,{"$f":"+E42","v":0},{"$f":"SUMPRODUCT((M_plage=\"v\")*15/1440)","v":0},6.25E-2,{"$f":"H42","v":0.20833333333333334},{"$f":"SUM(I42:I43)/TOTM","v":0},0,0,0,0,0,0,0,0,0,0,0,1,0,0,0,0,0,0,0,0,0,0,0,0]
[null,null,null,2,{"$f":"+E43","v":0},null,0.14583333333333334]
["2 Niveaux","N-1","Tennis C \nCourt N°1",1,{"$f":"+E44","v":0.20833333333333334},{"$f":"SUMPRODUCT((N1_plage=\"v\")*15/1440)","v":0.20833333333333326},2.5625,{"$f":"H44","v":3.3541666666666665},{"$f":"SUM(I44:I45)/TOTN","v":0},0,0,0,0,0,0,0,1,0,0,0,0,0,0,0,0,0,0,0,0,0,0,0,0]
[null,null,null,2,{"$f":"+E45","v":0},null,0.79166666666666663]
["2 Niveaux","N-2","Tennis C \nCourt N°2",1,{"$f":"+E46","v":0},{"$f":"SUMPRODUCT((N2_plage=\"v\")*15/1440)","v":0},3.0208333333333335,{"$f":"H46","v":3.854166666666667},{"$f":"SUM(I46:I47)/TOTO","v":0},0,0,0,0,0,0,0,1,0,0,0,0,0,0,0,0,0,0,0,0,0,0,0,0]
[null,null,null,2,{"$f":"+E47","v":0},null,0.83333333333333337]
["2 Niveaux","O","Salle G; Veymont",1,{"$f":"+E48","v":1.09375},{"$f":"SUMPRODUCT((P_plage=\"v\")*15/1440)","v":1.1249999999999993},1.3020833333333333,{"$f":"H48","v":2.1041666666666665},{"$f":"SUM(I48:I49)/TOTP","v":0},0,0,0,0,0,0,0,0,1,0,0,0,0,0,0,0,0,0,0,0,0,0,0,0]
[null,null,null,2,{"$f":"+E49","v":3.125E-2},null,0.80208333333333337]

{"sheet":"Suivi Réception","index":21,"n_rows":60,"n_cols":5,"rows_kept":60,"cut":false,"hidden":false,"merged":[]}
[null,{"$f":"'EQPT&UTIL'!B25","v":"2019-2020"}]
[]
["Min","REF","UTILISATEURS","Date réception "]
[{"$f":"+#REF!*15","v":{"$error":"#REF!"}},1,{"$f":"VLOOKUP(B4,UTILISATEURS,2)","v":"OMS"},{"$f":"+A!$Y2","v":0}]
[{"$f":"+#REF!*15","v":{"$error":"#REF!"}},1,{"$f":"INDEX(UTILISATEURS,MATCH($B5,RefUtil,0),2)","v":"OMS"},null,{"$f":"SUMPRODUCT(($B5='Récap TOUT'!$B5)*('Récap TOUT'!$C5>0)*1)","v":1}]
[{"$f":"+#REF!*15","v":{"$error":"#REF!"}},3,"J.B.E.",null,{"$f":"SUMPRODUCT(($B6='Récap TOUT'!$B6)*('Récap TOUT'!$C6>0)*1)","v":1}]
[{"$f":"+#REF!*15","v":{"$error":"#REF!"}},4,"GYM LOISIR",null,{"$f":"SUMPRODUCT(($B7='Récap TOUT'!$B7)*('Récap TOUT'!$C7>0)*1)","v":1}]
[{"$f":"+#REF!*15","v":{"$error":"#REF!"}},5,"BASKET",null,{"$f":"SUMPRODUCT(($B8='Récap TOUT'!$B8)*('Récap TOUT'!$C8>0)*1)","v":1}]
[{"$f":"+#REF!*15","v":{"$error":"#REF!"}},7,"CYCLOS",null,{"$f":"SUMPRODUCT(($B9='Récap TOUT'!$B9)*('Récap TOUT'!$C9>0)*1)","v":1}]
[{"$f":"+#REF!*15","v":{"$error":"#REF!"}},9,"GAULE",null,{"$f":"SUMPRODUCT(($B10='Récap TOUT'!$B10)*('Récap TOUT'!$C10>0)*1)","v":0}]
[{"$f":"+#REF!*15","v":{"$error":"#REF!"}},10,"JUDO",null,{"$f":"SUMPRODUCT(($B11='Récap TOUT'!$B11)*('Récap TOUT'!$C11>0)*1)","v":1}]
[{"$f":"+#REF!*15","v":{"$error":"#REF!"}},11,"LUTTE",null,{"$f":"SUMPRODUCT(($B12='Récap TOUT'!$B12)*('Récap TOUT'!$C12>0)*1)","v":1}]
[{"$f":"+#REF!*15","v":{"$error":"#REF!"}},15,"TENNIS  (2)",null,{"$f":"SUMPRODUCT(($B13='Récap TOUT'!$B14)*('Récap TOUT'!$C14>0)*1)","v":0}]
[{"$f":"+#REF!*15","v":{"$error":"#REF!"}},16,"CIRQUE (1)",null,{"$f":"SUMPRODUCT(($B14='Récap TOUT'!$B15)*('Récap TOUT'!$C15>0)*1)","v":0}]
[{"$f":"+#REF!*15","v":{"$error":"#REF!"}},17,"TAI JITSU",null,{"$f":"SUMPRODUCT(($B15='Récap TOUT'!$B16)*('Récap TOUT'!$C16>0)*1)","v":0}]
[{"$f":"+#REF!*15","v":{"$error":"#REF!"}},19,"G.VOLONTAIRE",null,{"$f":"SUMPRODUCT(($B16='Récap TOUT'!$B17)*('Récap TOUT'!$C17>0)*1)","v":0}]
[{"$f":"+#REF!*15","v":{"$error":"#REF!"}},20,"DIAGONALE",null,{"$f":"SUMPRODUCT(($B17='Récap TOUT'!$B18)*('Récap TOUT'!$C18>0)*1)","v":0}]
[{"$f":"+#REF!*15","v":{"$error":"#REF!"}},21,"A.C.E (1)",null,{"$f":"SUMPRODUCT(($B18='Récap TOUT'!$B19)*('Récap TOUT'!$C19>0)*1)","v":0}]
[{"$f":"+#REF!*15","v":{"$error":"#REF!"}},23,"ESCALADE",null,{"$f":"SUMPRODUCT(($B19='Récap TOUT'!$B20)*('Récap TOUT'!$C20>0)*1)","v":0}]
[{"$f":"+#REF!*15","v":{"$error":"#REF!"}},24,"ARCHERS",null,{"$f":"SUMPRODUCT(($B20='Récap TOUT'!$B21)*('Récap TOUT'!$C21>0)*1)","v":0}]
[{"$f":"+#REF!*15","v":{"$error":"#REF!"}},27,"O.C.E",null,{"$f":"SUMPRODUCT(($B21='Récap TOUT'!$B22)*('Récap TOUT'!$C22>0)*1)","v":0}]
[{"$f":"+#REF!*15","v":{"$error":"#REF!"}},28,"LAI MUOI",null,{"$f":"SUMPRODUCT(($B22='Récap TOUT'!$B23)*('Récap TOUT'!$C23>0)*1)","v":0}]
[{"$f":"+#REF!*15","v":{"$error":"#REF!"}},30,"TAEKWONDO",null,{"$f":"SUMPRODUCT(($B23='Récap TOUT'!$B24)*('Récap TOUT'!$C24>0)*1)","v":0}]
[{"$f":"+#REF!*15","v":{"$error":"#REF!"}},31,"E.S.A.G.A.M.I",null,{"$f":"SUMPRODUCT(($B24='Récap TOUT'!$B25)*('Récap TOUT'!$C25>0)*1)","v":0}]
[{"$f":"+#REF!*15","v":{"$error":"#REF!"}},32,"ALEETT",null,{"$f":"SUMPRODUCT(($B25='Récap TOUT'!$B26)*('Récap TOUT'!$C26>0)*1)","v":0}]
[{"$f":"+#REF!*15","v":{"$error":"#REF!"}},34,"SPIRIT 38",null,{"$f":"SUMPRODUCT(($B26='Récap TOUT'!$B27)*('Récap TOUT'!$C27>0)*1)","v":0}]
[{"$f":"+#REF!*15","v":{"$error":"#REF!"}},35,"GMC38EYBENS",null,{"$f":"SUMPRODUCT(($B27='Récap TOUT'!$B28)*('Récap TOUT'!$C28>0)*1)","v":0}]
[{"$f":"+#REF!*15","v":{"$error":"#REF!"}},36,"PETANQUE",null,{"$f":"SUMPRODUCT(($B28='Récap TOUT'!$B29)*('Récap TOUT'!$C29>0)*1)","v":0}]
[{"$f":"+#REF!*15","v":{"$error":"#REF!"}},37,"HBC2E",null,{"$f":"SUMPRODUCT(($B29='Récap TOUT'!$B30)*('Récap TOUT'!$C30>0)*1)","v":0}]
[{"$f":"+#REF!*15","v":{"$error":"#REF!"}},null,{"$error":"#N/A"},null,{"$f":"SUMPRODUCT(($B30='Récap TOUT'!$B31)*('Récap TOUT'!$C31>0)*1)","v":0}]
[{"$f":"+#REF!*15","v":{"$error":"#REF!"}},null,{"$error":"#N/A"},null,{"$f":"SUMPRODUCT(($B31='Récap TOUT'!$B32)*('Récap TOUT'!$C32>0)*1)","v":0}]
[{"$f":"+#REF!*15","v":{"$error":"#REF!"}},null,{"$error":"#N/A"},null,{"$f":"SUMPRODUCT(($B32='Récap TOUT'!$B33)*('Récap TOUT'!$C33>0)*1)","v":0}]
[{"$f":"+#REF!*15","v":{"$error":"#REF!"}},null,{"$error":"#N/A"},null,{"$f":"SUMPRODUCT(($B33='Récap TOUT'!$B34)*('Récap TOUT'!$C34>0)*1)","v":0}]
[{"$f":"+#REF!*15","v":{"$error":"#REF!"}},null,{"$error":"#N/A"},null,{"$f":"SUMPRODUCT(($B34='Récap TOUT'!$B35)*('Récap TOUT'!$C35>0)*1)","v":0}]
[null,null,{"$error":"#N/A"},null,{"$f":"SUMPRODUCT(($B35='Récap TOUT'!$B36)*('Récap TOUT'!$C36>0)*1)","v":0}]
[{"$f":"+#REF!*15","v":{"$error":"#REF!"}},50,{"$f":"INDEX(UTILISATEURS,MATCH($B36,RefUtil,0),2)","v":"SCOLAIRE"},null,{"$f":"SUMPRODUCT(($B36='Récap TOUT'!$B32)*('Récap TOUT'!$C32>0)*1)","v":1}]
[{"$f":"+#REF!*15","v":{"$error":"#REF!"}},51,"Sport Passion",null,{"$f":"SUMPRODUCT(($B37='Récap TOUT'!$B33)*('Récap TOUT'!$C33>0)*1)","v":1}]
[{"$f":"+#REF!*15","v":{"$error":"#REF!"}},52,"Péri Scolaire",null,{"$f":"SUMPRODUCT(($B38='Récap TOUT'!$B34)*('Récap TOUT'!$C34>0)*1)","v":1}]
[{"$f":"+#REF!*15","v":{"$error":"#REF!"}},53,"Crêche Familiale",null,{"$f":"SUMPRODUCT(($B39='Récap TOUT'!$B35)*('Récap TOUT'!$C35>0)*1)","v":1}]
[{"$f":"+#REF!*15","v":{"$error":"#REF!"}},54,"Rel Ass Matern",null,{"$f":"SUMPRODUCT(($B40='Récap TOUT'!$B36)*('Récap TOUT'!$C36>0)*1)","v":1}]
[{"$f":"+#REF!*15","v":{"$error":"#REF!"}},55,"?Pôle Enfance",null,{"$f":"SUMPRODUCT(($B41='Récap TOUT'!$B37)*('Récap TOUT'!$C37>0)*1)","v":1}]
[{"$f":"+#REF!*15","v":{"$error":"#REF!"}},56,"Anim. Municip.",null,{"$f":"SUMPRODUCT(($B42='Récap TOUT'!$B38)*('Récap TOUT'!$C38>0)*1)","v":1}]
[{"$f":"+#REF!*15","v":{"$error":"#REF!"}},57,"Crêche P Chose",null,{"$f":"SUMPRODUCT(($B43='Récap TOUT'!$B39)*('Récap TOUT'!$C39>0)*1)","v":0}]
[{"$f":"+#REF!*15","v":{"$error":"#REF!"}},58,0,null,{"$f":"SUMPRODUCT(($B44='Récap TOUT'!$B40)*('Récap TOUT'!$C40>0)*1)","v":0}]
[{"$f":"+#REF!*15","v":{"$error":"#REF!"}},59,"Police Municip",null,{"$f":"SUMPRODUCT(($B45='Récap TOUT'!$B41)*('Récap TOUT'!$C41>0)*1)","v":1}]
[{"$f":"+#REF!*15","v":{"$error":"#REF!"}},60,0,null,{"$f":"SUMPRODUCT(($B46='Récap TOUT'!$B42)*('Récap TOUT'!$C42>0)*1)","v":0}]
[{"$f":"+#REF!*15","v":{"$error":"#REF!"}},61,"-",null,{"$f":"SUMPRODUCT(($B47='Récap TOUT'!$B43)*('Récap TOUT'!$C43>0)*1)","v":0}]
[null,62,"EN ATTENTE",null,{"$f":"SUMPRODUCT(($B48='Récap TOUT'!$B49)*('Récap TOUT'!$C49>0)*1)","v":0}]
[{"$f":"+#REF!*15","v":{"$error":"#REF!"}},100,"POISAT",null,{"$f":"SUMPRODUCT(($B49='Récap TOUT'!$B44)*('Récap TOUT'!$C44>0)*1)","v":1}]
[{"$f":"+#REF!*15","v":{"$error":"#REF!"}},101,"ECHIROLLES",null,{"$f":"SUMPRODUCT(($B50='Récap TOUT'!$B45)*('Récap TOUT'!$C45>0)*1)","v":0}]
[{"$f":"+#REF!*15","v":{"$error":"#REF!"}},102,"H.P.",null,{"$f":"SUMPRODUCT(($B51='Récap TOUT'!$B46)*('Récap TOUT'!$C46>0)*1)","v":1}]
[{"$f":"+#REF!*15","v":{"$error":"#REF!"}},103,"I.M.E.",null,{"$f":"SUMPRODUCT(($B52='Récap TOUT'!$B47)*('Récap TOUT'!$C47>0)*1)","v":1}]
[{"$f":"+#REF!*15","v":{"$error":"#REF!"}},104,0,null,{"$f":"SUMPRODUCT(($B53='Récap TOUT'!$B48)*('Récap TOUT'!$C48>0)*1)","v":0}]
[{"$f":"+#REF!*15","v":{"$error":"#REF!"}},105,"Gendarm. Eybens",null,{"$f":"SUMPRODUCT(($B54='Récap TOUT'!$B49)*('Récap TOUT'!$C49>0)*1)","v":0}]
[{"$f":"+#REF!*15","v":{"$error":"#REF!"}},106,0,null,{"$f":"SUMPRODUCT(($B55='Récap TOUT'!$B50)*('Récap TOUT'!$C50>0)*1)","v":0}]
[null,107,"D.Country",null,{"$f":"SUMPRODUCT(($B56='Récap TOUT'!$B51)*('Récap TOUT'!$C51>0)*1)","v":1}]
[null,108,"CE SOPRA",null,{"$f":"SUMPRODUCT(($B57='Récap TOUT'!$B52)*('Récap TOUT'!$C52>0)*1)","v":1}]
[null,109,"ASCE",null,{"$f":"SUMPRODUCT(($B58='Récap TOUT'!$B53)*('Récap TOUT'!$C53>0)*1)","v":1}]
[null,110,"HARMONIE EYBENS",null,{"$f":"SUMPRODUCT(($B59='Récap TOUT'!$B54)*('Récap TOUT'!$C54>0)*1)","v":1}]
[null,111,0,null,{"$f":"SUMPRODUCT(($B60='Récap TOUT'!$B55)*('Récap TOUT'!$C55>0)*1)","v":0}]

{"sheet":"MATRICE 3 SsSco","index":22,"n_rows":59,"n_cols":22,"rows_kept":59,"cut":false,"hidden":false,"merged":[[1,19,1,21],[59,3,59,15],[0,0,0,3],[0,4,0,18],[1,1,1,3],[1,4,1,6],[1,7,1,9],[1,10,1,12],[1,13,1,15],[1,16,1,18]]}
[{"$f":"SAISON","v":"2019-2020"},null,null,null,"Matrice 3 niveaux Sans Scolaire"]
["09:00:00","Lundi",null,null,"Mardi",null,null,"Mercredi",null,null,"Jeudi",null,null,"Vendredi",null,null,"Samedi",null,null,"Dimanche"]
[{"$f":"+A2+$A$59","v":"09:15:00"},2,{"$f":"B3","v":2},{"$f":"B3","v":2},2,{"$f":"E3","v":2},{"$f":"E3","v":2},2,{"$f":"H3","v":2},{"$f":"H3","v":2},2,{"$f":"K3","v":2},{"$f":"K3","v":2},2,{"$f":"N3","v":2},{"$f":"N3","v":2},3,{"$f":"Q3","v":3},{"$f":"Q3","v":3},1,{"$f":"T3","v":1},{"$f":"T3","v":1}]
["09:30:00",2,2,2,2,2,2,2,2,2,2,2,2,2,2,2,3,3,3,1,1,1]
["09:45:00",2,2,2,2,2,2,2,2,2,2,2,2,2,2,2,3,3,3,1,1,1]
["10:00:00",2,2,2,2,2,2,2,2,2,2,2,2,2,2,2,3,3,3,1,1,1]
["10:15:00",2,2,2,2,2,2,2,2,2,2,2,2,2,2,2,3,3,3,1,1,1]
["10:30:00",2,2,2,2,2,2,2,2,2,2,2,2,2,2,2,3,3,3,1,1,1]
["10:45:00",2,2,2,2,2,2,2,2,2,2,2,2,2,2,2,3,3,3,1,1,1]
["11:00:00",2,2,2,2,2,2,2,2,2,2,2,2,2,2,2,3,3,3,1,1,1]
["11:15:00",2,2,2,2,2,2,2,2,2,2,2,2,2,2,2,3,3,3,1,1,1]
["11:30:00",2,2,2,2,2,2,2,2,2,2,2,2,2,2,2,3,3,3,1,1,1]
["11:45:00",2,2,2,2,2,2,2,2,2,2,2,2,2,2,2,3,3,3,1,1,1]
["12:00:00",2,2,2,2,2,2,2,2,2,2,2,2,2,2,2,3,3,3,1,1,1]
["12:15:00",2,2,2,2,2,2,2,2,2,2,2,2,2,2,2,1,1,1,1,1,1]
["12:30:00",2,2,2,2,2,2,2,2,2,2,2,2,2,2,2,1,1,1,1,1,1]
["12:45:00",2,2,2,2,2,2,2,2,2,2,2,2,2,2,2,1,1,1,1,1,1]
["13:00:00",2,2,2,2,2,2,2,2,2,2,2,2,2,2,2,1,1,1,1,1,1]
["13:15:00",2,2,2,2,2,2,2,2,2,2,2,2,2,2,2,1,1,1,1,1,1]
["13:30:00",2,2,2,2,2,2,2,2,2,2,2,2,2,2,2,1,1,1,1,1,1]
["13:45:00",1,1,1,1,1,1,3,3,3,1,1,1,1,1,1,1,1,1,1,1,1]
["14:00:00",1,1,1,1,1,1,3,3,3,1,1,1,1,1,1,1,1,1,1,1,1]
["14:15:00",1,1,1,1,1,1,3,3,3,1,1,1,1,1,1,1,1,1,1,1,1]
["14:30:00",1,1,1,1,1,1,3,3,3,1,1,1,1,1,1,1,1,1,1,1,1]
["14:45:00",1,1,1,1,1,1,3,3,3,1,1,1,1,1,1,1,1,1,1,1,1]
["15:00:00",1,1,1,1,1,1,3,3,3,1,1,1,1,1,1,1,1,1,1,1,1]
["15:15:00",1,1,1,1,1,1,3,3,3,1,1,1,1,1,1,1,1,1,1,1,1]
["15:30:00",1,1,1,1,1,1,3,3,3,1,1,1,1,1,1,1,1,1,1,1,1]
["15:45:00",1,1,1,1,1,1,3,3,3,1,1,1,1,1,1,1,1,1,1,1,1]
["16:00:00",1,1,1,1,1,1,3,3,3,1,1,1,1,1,1,1,1,1,1,1,1]
["16:15:00",1,1,1,1,1,1,3,3,3,1,1,1,1,1,1,1,1,1,1,1,1]
["16:30:00",1,1,1,1,1,1,3,3,3,1,1,1,1,1,1,1,1,1,1,1,1]
["16:45:00",1,1,1,1,1,1,3,3,3,1,1,1,1,1,1,1,1,1,1,1,1]
["17:00:00",1,1,1,1,1,1,3,3,3,1,1,1,1,1,1,1,1,1,1,1,1]
["17:15:00",1,1,1,1,1,1,3,3,3,1,1,1,1,1,1,1,1,1,1,1,1]
["17:30:00",1,1,1,1,1,1,3,3,3,1,1,1,1,1,1,1,1,1,1,1,1]
["17:45:00",2,2,2,2,2,2,3,3,3,2,2,2,2,2,2,1,1,1,1,1,1]
["18:00:00",2,2,2,2,2,2,3,3,3,2,2,2,2,2,2,1,1,1,1,1,1]
["18:15:00",2,2,2,2,2,2,3,3,3,2,2,2,2,2,2,1,1,1,1,1,1]
["18:30:00",2,2,2,2,2,2,3,3,3,2,2,2,2,2,2,1,1,1,1,1,1]
["18:45:00",3,3,3,3,3,3,3,3,3,3,3,3,3,3,3,1,1,1,1,1,1]
["19:00:00",3,3,3,3,3,3,3,3,3,3,3,3,3,3,3,1,1,1,1,1,1]
["19:15:00",3,3,3,3,3,3,3,3,3,3,3,3,3,3,3,1,1,1,1,1,1]
["19:30:00",3,3,3,3,3,3,3,3,3,3,3,3,3,3,3,1,1,1,1,1,1]
["19:45:00",3,3,3,3,3,3,3,3,3,3,3,3,3,3,3,1,1,1,1,1,1]
["20:00:00",3,3,3,3,3,3,3,3,3,3,3,3,3,3,3,1,1,1,1,1,1]
["20:15:00",3,3,3,3,3,3,3,3,3,3,3,3,3,3,3,1,1,1,1,1,1]
["20:30:00",3,3,3,3,3,3,3,3,3,3,3,3,3,3,3,1,1,1,1,1,1]
["20:45:00",2,2,2,2,2,2,3,3,3,2,2,2,2,2,2,1,1,1,1,1,1]
["21:00:00",2,2,2,2,2,2,3,3,3,2,2,2,2,2,2,1,1,1,1,1,1]
["21:15:00",2,2,2,2,2,2,2,2,2,2,2,2,2,2,2,1,1,1,1,1,1]
["21:30:00",2,2,2,2,2,2,2,2,2,2,2,2,2,2,2,1,1,1,1,1,1]
["21:45:00",2,2,2,2,2,2,2,2,2,2,2,2,2,2,2,1,1,1,1,1,1]
["22:00:00",2,2,2,2,2,2,2,2,2,2,2,2,2,2,2,1,1,1,1,1,1]
["22:15:00",1,1,1,1,1,1,1,1,1,1,1,1,1,1,1,1,1,1,1,1,1]
["22:30:00",1,1,1,1,1,1,1,1,1,1,1,1,1,1,1,1,1,1,1,1,1]
[null,1,1,1]
[]
["00:15:00",null,null,null,null,null,null,null,null,null,null,null,null,null,null,null,null,null,"Page N°",{"$f":"VLOOKUP($U$1,EQUIPEMENT,3)","v":{"$error":"#N/A"}}]

{"sheet":"MATRICE 3 AvSco","index":23,"n_rows":59,"n_cols":22,"rows_kept":59,"cut":false,"hidden":false,"merged":[[1,19,1,21],[59,3,59,15],[0,0,0,3],[0,4,0,18],[1,1,1,3],[1,4,1,6],[1,7,1,9],[1,10,1,12],[1,13,1,15],[1,16,1,18]]}
[{"$f":"SAISON","v":"2019-2020"},null,null,null,"Matrice   3 Niveaux avec Scolaires"]
["09:00:00","Lundi",null,null,"Mardi",null,null,"Mercredi",null,null,"Jeudi",null,null,"Vendredi",null,null,"Samedi",null,null,"Dimanche"]
[{"$f":"+A2+$A$59","v":"09:15:00"},1,{"$f":"B3","v":1},{"$f":"B3","v":1},1,{"$f":"E3","v":1},{"$f":"E3","v":1},1,{"$f":"H3","v":1},{"$f":"H3","v":1},1,{"$f":"K3","v":1},{"$f":"K3","v":1},1,{"$f":"N3","v":1},{"$f":"N3","v":1},3,{"$f":"Q3","v":3},{"$f":"Q3","v":3},1,{"$f":"T3","v":1},{"$f":"T3","v":1}]
["09:30:00",1,1,1,1,1,1,1,1,1,1,1,1,1,1,1,3,3,3,1,1,1]
["09:45:00",1,1,1,1,1,1,1,1,1,1,1,1,1,1,1,3,3,3,1,1,1]
["10:00:00",1,1,1,1,1,1,1,1,1,1,1,1,1,1,1,3,3,3,1,1,1]
["10:15:00",1,1,1,1,1,1,1,1,1,1,1,1,1,1,1,3,3,3,1,1,1]
["10:30:00",1,1,1,1,1,1,1,1,1,1,1,1,1,1,1,3,3,3,1,1,1]
["10:45:00",1,1,1,1,1,1,1,1,1,1,1,1,1,1,1,3,3,3,1,1,1]
["11:00:00",1,1,1,1,1,1,1,1,1,1,1,1,1,1,1,3,3,3,1,1,1]
["11:15:00",1,1,1,1,1,1,1,1,1,1,1,1,1,1,1,3,3,3,1,1,1]
["11:30:00",1,1,1,1,1,1,1,1,1,1,1,1,1,1,1,3,3,3,1,1,1]
["11:45:00",2,2,2,2,2,2,2,2,2,2,2,2,2,2,2,3,3,3,1,1,1]
["12:00:00",2,2,2,2,2,2,2,2,2,2,2,2,2,2,2,3,3,3,1,1,1]
["12:15:00",2,2,2,2,2,2,2,2,2,2,2,2,2,2,2,3,{"$f":"Q15","v":3},{"$f":"Q15","v":3},1,1,1]
["12:30:00",2,2,2,2,2,2,2,2,2,2,2,2,2,2,2,3,3,3,1,1,1]
["12:45:00",2,2,2,2,2,2,2,2,2,2,2,2,2,2,2,3,3,3,1,1,1]
["13:00:00",2,2,2,2,2,2,2,2,2,2,2,2,2,2,2,3,3,3,1,1,1]
["13:15:00",1,1,1,1,1,1,3,3,3,1,1,1,1,1,1,1,1,1,1,1,1]
["13:30:00",1,1,1,1,1,1,3,3,3,1,1,1,1,1,1,1,1,1,1,1,1]
["13:45:00",1,1,1,1,1,1,3,3,3,1,1,1,1,1,1,1,1,1,1,1,1]
["14:00:00",1,1,1,1,1,1,3,3,3,1,1,1,1,1,1,1,1,1,1,1,1]
["14:15:00",1,1,1,1,1,1,3,3,3,1,1,1,1,1,1,1,1,1,1,1,1]
["14:30:00",1,1,1,1,1,1,3,3,3,1,1,1,1,1,1,1,1,1,1,1,1]
["14:45:00",1,1,1,1,1,1,3,3,3,1,1,1,1,1,1,1,1,1,1,1,1]
["15:00:00",1,1,1,1,1,1,3,3,3,1,1,1,1,1,1,1,1,1,1,1,1]
["15:15:00",1,1,1,1,1,1,3,3,3,1,1,1,1,1,1,1,1,1,1,1,1]
["15:30:00",1,1,1,1,1,1,3,3,3,1,1,1,1,1,1,1,1,1,1,1,1]
["15:45:00",1,1,1,1,1,1,3,3,3,1,1,1,1,1,1,1,1,1,1,1,1]
["16:00:00",1,1,1,1,1,1,3,3,3,1,1,1,1,1,1,1,1,1,1,1,1]
["16:15:00",1,1,1,1,1,1,3,3,3,1,1,1,1,1,1,1,1,1,1,1,1]
["16:30:00",1,1,1,1,1,1,3,3,3,1,1,1,1,1,1,1,1,1,1,1,1]
["16:45:00",1,1,1,1,1,1,3,3,3,1,1,1,1,1,1,1,1,1,1,1,1]
["17:00:00",1,1,1,1,1,1,3,3,3,1,1,1,1,1,1,1,1,1,1,1,1]
["17:15:00",1,{"$f":"B35","v":1},{"$f":"B35","v":1},1,1,1,3,3,3,1,1,1,1,1,1,1,{"$f":"Q35","v":1},{"$f":"Q35","v":1},1,1,1]
["17:30:00",1,1,1,1,1,1,3,3,3,1,1,1,1,1,1,1,1,1,1,1,1]
["17:45:00",2,2,2,2,{"$f":"E37","v":2},{"$f":"E37","v":2},3,3,3,2,{"$f":"K37","v":2},{"$f":"K37","v":2},2,{"$f":"N37","v":2},{"$f":"N37","v":2},1,1,1,1,{"$f":"T37","v":1},{"$f":"T37","v":1}]
["18:00:00",2,2,2,2,2,2,3,3,3,2,2,2,2,2,2,1,1,1,1,1,1]
["18:15:00",2,2,2,3,3,3,3,{"$f":"H39","v":3},{"$f":"H39","v":3},3,3,3,3,3,3,1,1,1,1,1,1]
["18:30:00",2,2,2,3,3,3,3,3,3,3,3,3,3,3,3,1,1,1,1,1,1]
["18:45:00",3,3,3,3,3,3,3,3,3,3,3,3,3,3,3,1,1,1,1,1,1]
["19:00:00",3,3,3,3,3,3,3,3,3,3,3,3,3,3,3,1,1,1,1,1,1]
["19:15:00",3,3,3,3,3,3,3,3,3,3,3,3,3,3,3,1,1,1,1,1,1]
["19:30:00",3,3,3,3,3,3,3,3,3,3,3,3,3,3,3,1,1,1,1,1,1]
["19:45:00",3,3,3,3,3,3,3,3,3,3,3,3,3,3,3,1,1,1,1,1,1]
["20:00:00",3,3,3,3,3,3,3,3,3,3,3,3,3,3,3,1,1,1,1,1,1]
["20:15:00",3,3,3,3,3,3,3,3,3,3,3,3,3,3,3,1,1,1,1,1,1]
["20:30:00",3,3,3,3,3,3,3,3,3,3,3,3,3,3,3,1,1,1,1,1,1]
["20:45:00",2,2,2,2,2,2,3,3,3,2,2,2,2,2,2,1,1,1,1,1,1]
["21:00:00",2,2,2,2,2,2,3,3,3,2,2,2,2,2,2,1,1,1,1,1,1]
["21:15:00",2,2,2,2,2,2,2,2,2,2,2,2,2,2,2,1,{"$f":"Q51","v":1},{"$f":"Q51","v":1},1,1,1]
["21:30:00",2,2,2,2,2,2,2,2,2,2,2,2,2,2,2,1,1,1,1,1,1]
["21:45:00",2,2,2,2,2,2,2,2,2,2,2,2,2,2,2,1,1,1,1,1,1]
["22:00:00",2,2,2,2,2,2,2,2,2,2,2,2,2,2,2,1,1,1,1,1,1]
["22:15:00",1,1,{"$f":"B55","v":1},1,1,{"$f":"E55","v":1},1,1,{"$f":"H55","v":1},1,1,{"$f":"K55","v":1},1,1,{"$f":"N55","v":1},1,1,{"$f":"Q55","v":1},1,1,1]
["22:30:00",1,1,1,1,1,1,1,1,1,1,1,1,1,1,1,1,1,1,1,1,1]
[]
[]
["00:15:00",null,null,null,null,null,null,null,null,null,null,null,null,null,null,null,null,null,"Page N°",{"$f":"VLOOKUP($U$1,EQUIPEMENT,3)","v":{"$error":"#N/A"}}]

{"sheet":"MATRICE 2","index":24,"n_rows":59,"n_cols":22,"rows_kept":59,"cut":false,"hidden":false,"merged":[[1,19,1,21],[59,3,59,15],[0,0,0,3],[0,4,0,18],[1,1,1,3],[1,4,1,6],[1,7,1,9],[1,10,1,12],[1,13,1,15],[1,16,1,18]]}
[{"$f":"SAISON","v":"2019-2020"},null,null,null,"MATRICE  2 Niveaux "]
["09:00:00","Lundi",null,null,"Mardi",null,null,"Mercredi",null,null,"Jeudi",null,null,"Vendredi",null,null,"Samedi",null,null,"Dimanche"]
[{"$f":"+A2+$A$59","v":"09:15:00"},1,{"$f":"B3","v":1},{"$f":"B3","v":1},1,{"$f":"E3","v":1},{"$f":"E3","v":1},1,{"$f":"H3","v":1},{"$f":"H3","v":1},1,{"$f":"K3","v":1},{"$f":"K3","v":1},1,{"$f":"N3","v":1},{"$f":"N3","v":1},2,{"$f":"Q3","v":2},{"$f":"Q3","v":2},1,{"$f":"T3","v":1},{"$f":"T3","v":1}]
["09:30:00",1,1,1,1,1,1,1,1,1,1,1,1,1,1,1,2,2,2,1,1,1]
["09:45:00",1,1,1,1,1,1,1,1,1,1,1,1,1,1,1,2,2,2,1,1,1]
["10:00:00",1,1,1,1,1,1,1,1,1,1,1,1,1,1,1,2,2,2,1,1,1]
["10:15:00",1,1,1,1,1,1,1,1,1,1,1,1,1,1,1,2,2,2,1,1,1]
["10:30:00",1,1,1,1,1,1,1,1,1,1,1,1,1,1,1,2,2,2,1,1,1]
["10:45:00",1,1,1,1,1,1,1,1,1,1,1,1,1,1,1,2,2,2,1,1,1]
["11:00:00",1,1,1,1,1,1,1,1,1,1,1,1,1,1,1,2,2,2,1,1,1]
["11:15:00",1,1,1,1,1,1,1,1,1,1,1,1,1,1,1,2,2,2,1,1,1]
["11:30:00",1,1,1,1,1,1,1,1,1,1,1,1,1,1,1,2,2,2,1,1,1]
["11:45:00",1,1,1,1,1,1,1,1,1,1,1,1,1,1,1,1,1,1,1,1,1]
["12:00:00",1,1,1,1,1,1,1,1,1,1,1,1,1,1,1,1,1,1,1,1,1]
["12:15:00",1,1,1,1,1,1,1,1,1,1,1,1,1,1,1,1,1,1,1,1,1]
["12:30:00",1,1,1,1,1,1,1,1,1,1,1,1,1,1,1,1,1,1,1,1,1]
["12:45:00",1,1,1,1,1,1,1,1,1,1,1,1,1,1,1,1,1,1,1,1,1]
["13:00:00",1,1,1,1,1,1,1,1,1,1,1,1,1,1,1,1,1,1,1,1,1]
["13:15:00",1,1,1,1,1,1,1,1,1,1,1,1,1,1,1,1,1,1,1,1,1]
["13:30:00",1,1,1,1,1,1,1,1,1,1,1,1,1,1,1,1,1,1,1,1,1]
["13:45:00",1,1,1,1,1,1,2,2,2,1,1,1,1,1,1,1,1,1,1,1,1]
["14:00:00",1,1,1,1,1,1,2,2,2,1,1,1,1,1,1,1,1,1,1,1,1]
["14:15:00",1,1,1,1,1,1,2,2,2,1,1,1,1,1,1,1,1,1,1,1,1]
["14:30:00",1,1,1,1,1,1,2,2,2,1,1,1,1,1,1,1,1,1,1,1,1]
["14:45:00",1,1,1,1,1,1,2,2,2,1,1,1,1,1,1,1,1,1,1,1,1]
["15:00:00",1,1,1,1,1,1,2,2,2,1,1,1,1,1,1,1,1,1,1,1,1]
["15:15:00",1,1,1,1,1,1,2,2,2,1,1,1,1,1,1,1,1,1,1,1,1]
["15:30:00",1,1,1,1,1,1,2,2,2,1,1,1,1,1,1,1,1,1,1,1,1]
["15:45:00",1,1,1,1,1,1,2,2,2,1,1,1,1,1,1,1,1,1,1,1,1]
["16:00:00",1,1,1,1,1,1,2,2,2,1,1,1,1,1,1,1,1,1,1,1,1]
["16:15:00",1,1,1,1,1,1,2,2,2,1,1,1,1,1,1,1,1,1,1,1,1]
["16:30:00",1,1,1,1,1,1,2,2,2,1,1,1,1,1,1,1,1,1,1,1,1]
["16:45:00",1,1,1,1,1,1,2,2,2,1,1,1,1,1,1,1,1,1,1,1,1]
["17:00:00",1,1,1,1,1,1,2,2,2,1,1,1,1,1,1,1,1,1,1,1,1]
["17:15:00",1,{"$f":"B35","v":1},{"$f":"B35","v":1},1,1,1,2,2,2,1,1,1,1,1,1,1,1,1,1,1,1]
["17:30:00",1,1,1,1,1,1,2,2,2,1,1,1,1,1,1,1,1,1,1,1,1]
["17:45:00",1,1,1,1,1,1,2,2,2,1,1,1,1,1,1,1,1,1,1,1,1]
["18:00:00",1,1,1,1,1,1,2,2,2,1,1,1,1,1,1,1,1,1,1,1,1]
["18:15:00",1,1,1,1,1,1,2,2,2,1,1,1,1,1,1,1,1,1,1,1,1]
["18:30:00",1,1,1,1,1,1,2,2,2,1,1,1,1,1,1,1,1,1,1,1,1]
["18:45:00",2,2,2,2,{"$f":"E41","v":2},{"$f":"E41","v":2},2,{"$f":"H41","v":2},{"$f":"H41","v":2},2,{"$f":"K41","v":2},{"$f":"K41","v":2},2,{"$f":"N41","v":2},{"$f":"N41","v":2},1,{"$f":"Q41","v":1},{"$f":"Q41","v":1},1,1,1]
["19:00:00",2,2,2,2,2,2,2,2,2,2,2,2,2,2,2,1,1,1,1,1,1]
["19:15:00",2,2,2,2,2,2,2,2,2,2,2,2,2,2,2,1,1,1,1,1,1]
["19:30:00",2,2,2,2,2,2,2,2,2,2,2,2,2,2,2,1,1,1,1,1,1]
["19:45:00",2,2,2,2,2,2,2,2,2,2,2,2,2,2,2,1,1,1,1,1,1]
["20:00:00",2,2,2,2,2,2,2,2,2,2,2,2,2,2,2,1,1,1,1,1,1]
["20:15:00",2,2,2,2,2,2,2,2,2,2,2,2,2,2,2,1,1,1,1,1,1]
["20:30:00",2,2,2,2,2,2,2,2,2,2,2,2,2,2,2,1,1,1,1,1,1]
["20:45:00",2,2,2,2,2,2,2,2,2,2,2,2,2,2,2,1,1,1,1,1,1]
["21:00:00",2,2,2,2,2,2,2,2,2,2,2,2,2,2,2,1,1,1,1,1,1]
["21:15:00",1,1,1,1,1,1,1,1,1,1,1,1,1,1,1,1,1,1,1,1,1]
["21:30:00",1,1,1,1,1,1,1,1,1,1,1,1,1,1,1,1,1,1,1,1,1]
["21:45:00",1,1,1,1,1,1,1,1,1,1,1,1,1,1,1,1,1,1,1,1,1]
["22:00:00",1,1,1,1,1,1,1,1,1,1,1,1,1,1,1,1,1,1,1,1,1]
["22:15:00",1,1,{"$f":"B55","v":1},1,1,{"$f":"E55","v":1},1,1,{"$f":"H55","v":1},1,1,{"$f":"K55","v":1},1,1,{"$f":"N55","v":1},1,1,{"$f":"Q55","v":1},1,1,1]
["22:30:00",1,1,1,1,1,1,1,1,1,1,1,1,1,1,1,1,1,1,1,1,1]
[null,null,null,null,null,null,null,null,null,null,null,null,null,null,null,null,1,1,1]
[]
["00:15:00",null,null,null,null,null,null,null,null,null,null,null,null,null,null,null,null,null,"Page N°",{"$f":"VLOOKUP($U$1,EQUIPEMENT,3)","v":{"$error":"#N/A"}}]

{"sheet":"Statitisques","index":25,"n_rows":40,"n_cols":29,"rows_kept":40,"cut":false,"hidden":false,"merged":[[8,1,8,2],[9,1,10,2]]}
[]
[1,{"$f":"'Récap OMS Plus'!I6","v":0.125},{"$f":"'Récap OMS Plus'!J6","v":1.1979166666666665},{"$f":"'Récap OMS Plus'!K6","v":0.97916666666666674},{"$f":"'Récap OMS Plus'!L6","v":2.3020833333333335},{"$f":"'Récap OMS Plus'!M6","v":8.3333333333333329E-2},{"$f":"'Récap OMS Plus'!N6","v":0},{"$f":"'Récap OMS Plus'!O6","v":0.98958333333333326},{"$f":"'Récap OMS Plus'!P6","v":0.16666666666666666},null,{"$f":"'Récap OMS Plus'!Q6","v":7.208333333333333},{"$f":"'Récap OMS Plus'!R6","v":2.1041666666666665},{"$f":"'Récap OMS Plus'!S6","v":0.39583333333333337},{"$f":"'Récap OMS Plus'!T6","v":0.67708333333333337},{"$f":"'Récap OMS Plus'!U6","v":0.20833333333333334},{"$f":"'Récap OMS Plus'!V6","v":0},{"$f":"'Récap OMS Plus'!W6","v":0.58333333333333326},{"$f":"'Récap OMS Plus'!X6","v":0.63541666666666674},{"$f":"'Récap OMS Plus'!Y6","v":2.270833333333333},{"$f":"'Récap OMS Plus'!Z6","v":0.16666666666666669},{"$f":"'Récap OMS Plus'!AA6","v":0.41666666666666669},{"$f":"'Récap OMS Plus'!AB6","v":0.5},{"$f":"'Récap OMS Plus'!AC6","v":0.5},{"$f":"'Récap OMS Plus'!AD6","v":0.51041666666666674},{"$f":"'Récap OMS Plus'!AE6","v":0},{"$f":"'Récap OMS Plus'!AF6","v":0.58333333333333337},{"$f":"'Récap OMS Plus'!AG6","v":1.2291666666666665},{"$f":"'Récap OMS Plus'!AH6","v":0},{"$f":"'Récap OMS Plus'!AI6","v":0}]
[2,{"$f":"'Récap OMS Plus'!I7","v":0},{"$f":"'Récap OMS Plus'!J7","v":0.65625},{"$f":"'Récap OMS Plus'!K7","v":0.44791666666666663},{"$f":"'Récap OMS Plus'!L7","v":0.40625},{"$f":"'Récap OMS Plus'!M7","v":6.25E-2},{"$f":"'Récap OMS Plus'!N7","v":0},{"$f":"'Récap OMS Plus'!O7","v":0.21875},{"$f":"'Récap OMS Plus'!P7","v":0},null,{"$f":"'Récap OMS Plus'!Q7","v":5.5833333333333339},{"$f":"'Récap OMS Plus'!R7","v":1.3020833333333333},{"$f":"'Récap OMS Plus'!S7","v":0.14583333333333334},{"$f":"'Récap OMS Plus'!T7","v":0.11458333333333333},{"$f":"'Récap OMS Plus'!U7","v":6.25E-2},{"$f":"'Récap OMS Plus'!V7","v":0},{"$f":"'Récap OMS Plus'!W7","v":3.125E-2},{"$f":"'Récap OMS Plus'!X7","v":0.10416666666666667},{"$f":"'Récap OMS Plus'!Y7","v":0.5},{"$f":"'Récap OMS Plus'!Z7","v":0},{"$f":"'Récap OMS Plus'!AA7","v":2.0833333333333332E-2},{"$f":"'Récap OMS Plus'!AB7","v":0},{"$f":"'Récap OMS Plus'!AC7","v":6.25E-2},{"$f":"'Récap OMS Plus'!AD7","v":6.25E-2},{"$f":"'Récap OMS Plus'!AE7","v":0},{"$f":"'Récap OMS Plus'!AF7","v":0.375},{"$f":"'Récap OMS Plus'!AG7","v":0.125},{"$f":"'Récap OMS Plus'!AH7","v":0},{"$f":"'Récap OMS Plus'!AI7","v":0}]
[3,{"$f":"'Récap OMS Plus'!I8","v":0.125},{"$f":"'Récap OMS Plus'!J8","v":0.10416666666666667},{"$f":"'Récap OMS Plus'!K8","v":0.29166666666666669},{"$f":"'Récap OMS Plus'!L8","v":0.83333333333333326},{"$f":"'Récap OMS Plus'!M8","v":2.0833333333333332E-2},{"$f":"'Récap OMS Plus'!N8","v":0},{"$f":"'Récap OMS Plus'!O8","v":0.33333333333333331},{"$f":"'Récap OMS Plus'!P8","v":4.1666666666666664E-2},null,{"$f":"'Récap OMS Plus'!Q8","v":1.625},{"$f":"'Récap OMS Plus'!R8","v":0.80208333333333337},{"$f":"'Récap OMS Plus'!S8","v":0.10416666666666667},{"$f":"'Récap OMS Plus'!T8","v":0.4375},{"$f":"'Récap OMS Plus'!U8","v":0.14583333333333334},{"$f":"'Récap OMS Plus'!V8","v":0},{"$f":"'Récap OMS Plus'!W8","v":0.1875},{"$f":"'Récap OMS Plus'!X8","v":0.1875},{"$f":"'Récap OMS Plus'!Y8","v":1.770833333333333},{"$f":"'Récap OMS Plus'!Z8","v":6.25E-2},{"$f":"'Récap OMS Plus'!AA8","v":0.25},{"$f":"'Récap OMS Plus'!AB8","v":2.0833333333333332E-2},{"$f":"'Récap OMS Plus'!AC8","v":0.16666666666666666},{"$f":"'Récap OMS Plus'!AD8","v":0.10416666666666667},{"$f":"'Récap OMS Plus'!AE8","v":0},{"$f":"'Récap OMS Plus'!AF8","v":4.1666666666666664E-2},{"$f":"'Récap OMS Plus'!AG8","v":0.375},{"$f":"'Récap OMS Plus'!AH8","v":0},{"$f":"'Récap OMS Plus'!AI8","v":0}]
[4,{"$f":"'Récap OMS Plus'!I9","v":0},{"$f":"'Récap OMS Plus'!J9","v":0.4375},{"$f":"'Récap OMS Plus'!K9","v":0.23958333333333331},{"$f":"'Récap OMS Plus'!L9","v":1.0625},{"$f":"'Récap OMS Plus'!M9","v":0},{"$f":"'Récap OMS Plus'!N9","v":0},{"$f":"'Récap OMS Plus'!O9","v":0.4375},{"$f":"'Récap OMS Plus'!P9","v":0.125},null,{"$f":"'Récap OMS Plus'!Q9","v":0},{"$f":"'Récap OMS Plus'!R9","v":0},{"$f":"'Récap OMS Plus'!S9","v":0.14583333333333334},{"$f":"'Récap OMS Plus'!T9","v":0.125},{"$f":"'Récap OMS Plus'!U9","v":0},{"$f":"'Récap OMS Plus'!V9","v":0},{"$f":"'Récap OMS Plus'!W9","v":0.36458333333333331},{"$f":"'Récap OMS Plus'!X9","v":0.34375},{"$f":"'Récap OMS Plus'!Y9","v":0},{"$f":"'Récap OMS Plus'!Z9","v":0.10416666666666667},{"$f":"'Récap OMS Plus'!AA9","v":0.14583333333333334},{"$f":"'Récap OMS Plus'!AB9","v":0.47916666666666663},{"$f":"'Récap OMS Plus'!AC9","v":0.27083333333333331},{"$f":"'Récap OMS Plus'!AD9","v":0.34375},{"$f":"'Récap OMS Plus'!AE9","v":0},{"$f":"'Récap OMS Plus'!AF9","v":0.16666666666666666},{"$f":"'Récap OMS Plus'!AG9","v":0.72916666666666663},{"$f":"'Récap OMS Plus'!AH9","v":0},{"$f":"'Récap OMS Plus'!AI9","v":0}]
[5,{"$f":"'Récap OMS Plus'!I10","v":1},{"$f":"'Récap OMS Plus'!J10","v":3},{"$f":"'Récap OMS Plus'!K10","v":4},{"$f":"'Récap OMS Plus'!L10","v":5},{"$f":"'Récap OMS Plus'!M10","v":7},{"$f":"'Récap OMS Plus'!N10","v":9},{"$f":"'Récap OMS Plus'!O10","v":10},{"$f":"'Récap OMS Plus'!P10","v":11},null,{"$f":"'Récap OMS Plus'!Q10","v":15},{"$f":"'Récap OMS Plus'!R10","v":16},{"$f":"'Récap OMS Plus'!S10","v":17},{"$f":"'Récap OMS Plus'!T10","v":19},{"$f":"'Récap OMS Plus'!U10","v":20},{"$f":"'Récap OMS Plus'!V10","v":21},{"$f":"'Récap OMS Plus'!W10","v":23},{"$f":"'Récap OMS Plus'!X10","v":24},{"$f":"'Récap OMS Plus'!Y10","v":27},{"$f":"'Récap OMS Plus'!Z10","v":28},{"$f":"'Récap OMS Plus'!AA10","v":30},{"$f":"'Récap OMS Plus'!AB10","v":31},{"$f":"'Récap OMS Plus'!AC10","v":32},{"$f":"'Récap OMS Plus'!AD10","v":34},{"$f":"'Récap OMS Plus'!AE10","v":35},{"$f":"'Récap OMS Plus'!AF10","v":36},{"$f":"'Récap OMS Plus'!AG10","v":37},{"$f":"'Récap OMS Plus'!AH10","v":0},{"$f":"'Récap OMS Plus'!AI10","v":0}]
[6,{"$f":"'Récap OMS Plus'!I11","v":"OMS"},{"$f":"'Récap OMS Plus'!J11","v":"J.B.E."},{"$f":"'Récap OMS Plus'!K11","v":"GYM LOISIR"},{"$f":"'Récap OMS Plus'!L11","v":"BASKET"},{"$f":"'Récap OMS Plus'!M11","v":"CYCLOS"},{"$f":"'Récap OMS Plus'!N11","v":"GAULE"},{"$f":"'Récap OMS Plus'!O11","v":"JUDO"},{"$f":"'Récap OMS Plus'!P11","v":"LUTTE"},null,{"$f":"'Récap OMS Plus'!Q11","v":"TENNIS  (2)"},{"$f":"'Récap OMS Plus'!R11","v":"CIRQUE (1)"},{"$f":"'Récap OMS Plus'!S11","v":"TAI JITSU"},{"$f":"'Récap OMS Plus'!T11","v":"G.VOLONTAIRE"},{"$f":"'Récap OMS Plus'!U11","v":"DIAGONALE"},{"$f":"'Récap OMS Plus'!V11","v":"A.C.E (1)"},{"$f":"'Récap OMS Plus'!W11","v":"ESCALADE"},{"$f":"'Récap OMS Plus'!X11","v":"ARCHERS"},{"$f":"'Récap OMS Plus'!Y11","v":"O.C.E"},{"$f":"'Récap OMS Plus'!Z11","v":"LAI MUOI"},{"$f":"'Récap OMS Plus'!AA11","v":"TAEKWONDO"},{"$f":"'Récap OMS Plus'!AB11","v":"E.S.A.G.A.M.I"},{"$f":"'Récap OMS Plus'!AC11","v":"ALEETT"},{"$f":"'Récap OMS Plus'!AD11","v":"SPIRIT 38"},{"$f":"'Récap OMS Plus'!AE11","v":"GMC38EYBENS"},{"$f":"'Récap OMS Plus'!AF11","v":"PETANQUE"},{"$f":"'Récap OMS Plus'!AG11","v":"HBC2E"},{"$f":"'Récap OMS Plus'!AH11","v":0},{"$f":"'Récap OMS Plus'!AI11","v":0}]
[]
[null,"RESULTATS"]
[null,"Pour l'ensemble des équipemens",null,null,"Répartition Interne Club > Répartion  en % du temps total par Niveaux de chaque club"]
[null,null,null,null,"Part Du Total, pour chacun des niveaux, % d'utilisation par un club, du total utilisé "]
[null,null,null,null,null,"en vert les 4 meilleurs"]
[null,null,null,"Total","Niveau1","RIC","PDT","Niveau2","RIC","PDT","Niveau3","RIC","PDT"]
[1,{"$f":"TRANSPOSE(B6:AC7)","v":1},"OMS",{"$f":"TRANSPOSE(B2:AC2)","v":0.125},{"$f":"TRANSPOSE(B3:AC3)","v":0},{"$f":"E14/$D14","v":0},{"$f":"E14/$E$40","v":0},{"$f":"TRANSPOSE((B4:AC4))","v":0.125},{"$f":"H14/$D14","v":1},{"$f":"H14/$H$40","v":1.556420233463035E-2},{"$f":"TRANSPOSE(B5:AC5)","v":0},{"$f":"K14/$D14","v":0},{"$f":"K14/$K$40","v":0}]
[2,3,"J.B.E.",1.1979166666666665,0.65625,{"$f":"E15/$D15","v":0.5478260869565218},{"$f":"E15/$E$40","v":6.3829787234042548E-2},0.10416666666666667,{"$f":"H15/$D15","v":8.6956521739130446E-2},{"$f":"H15/$H$40","v":1.2970168612191959E-2},0.4375,0.36521739130434788,{"$f":"K15/$K$40","v":7.9245283018867921E-2}]
[3,4,"GYM LOISIR",0.97916666666666674,0.44791666666666663,0.45744680851063824,4.3566362715298873E-2,0.29166666666666669,0.2978723404255319,3.6316472114137487E-2,0.23958333333333331,0.24468085106382975,{"$f":"K16/$K$40","v":4.339622641509433E-2}]
[4,5,"BASKET",2.3020833333333335,0.40625,0.1764705882352941,3.9513677811550144E-2,0.83333333333333326,0.36199095022624428,0.10376134889753566,1.0625,0.46153846153846151,0.19245283018867923]
[5,7,"CYCLOS",8.3333333333333329E-2,6.25E-2,0.75,6.0790273556230994E-3,2.0833333333333332E-2,0.25,2.5940337224383916E-3,0,0,0]
[6,9,"GAULE",0,0,{"$error":"#DIV/0!"},0,0,{"$error":"#DIV/0!"},0,0,{"$error":"#DIV/0!"},0]
[7,10,"JUDO",0.98958333333333326,0.21875,0.22105263157894739,2.1276595744680847E-2,0.33333333333333331,0.33684210526315789,4.1504539559014265E-2,0.4375,0.44210526315789478,7.9245283018867921E-2]
[8,11,"LUTTE",0.16666666666666666,0,0,0,4.1666666666666664E-2,0.25,5.1880674448767832E-3,0.125,0.75,2.2641509433962263E-2]
[9,0,0,0,0,{"$error":"#DIV/0!"},0,0,{"$error":"#DIV/0!"},0,0,{"$error":"#DIV/0!"},0]
[10,15,"TENNIS  (2)",7.208333333333333,5.5833333333333339,0.77456647398843947,0.54305977710233022,1.625,0.22543352601156069,0.20233463035019456,0,0,0]
[11,16,"CIRQUE (1)",2.1041666666666665,1.3020833333333333,0.61881188118811881,0.1266464032421479,0.80208333333333337,0.38118811881188125,9.9870298313878086E-2,0,0,0]
[12,17,"TAI JITSU",0.39583333333333337,0.14583333333333334,0.36842105263157893,1.4184397163120565E-2,0.10416666666666667,0.26315789473684209,1.2970168612191959E-2,0.14583333333333334,0.36842105263157893,2.6415094339622639E-2]
[13,19,"G.VOLONTAIRE",0.67708333333333337,0.11458333333333333,0.16923076923076921,1.1144883485309015E-2,0.4375,0.64615384615384608,5.4474708171206226E-2,0.125,0.1846153846153846,2.2641509433962263E-2]
[14,20,"DIAGONALE",0.20833333333333334,6.25E-2,0.3,6.0790273556230994E-3,0.14583333333333334,0.70000000000000007,1.8158236057068743E-2,0,0,0]
[15,21,"A.C.E (1)",0,0,{"$error":"#DIV/0!"},0,0,{"$error":"#DIV/0!"},0,0,{"$error":"#DIV/0!"},0]
[16,23,"ESCALADE",0.58333333333333326,3.125E-2,5.3571428571428575E-2,3.0395136778115497E-3,0.1875,0.32142857142857145,2.3346303501945526E-2,0.36458333333333331,0.625,6.6037735849056589E-2]
[17,24,"ARCHERS",0.63541666666666674,0.10416666666666667,0.16393442622950818,1.0131712259371832E-2,0.1875,0.29508196721311469,2.3346303501945526E-2,0.34375,0.54098360655737698,6.226415094339622E-2]
[18,27,"O.C.E",2.270833333333333,0.5,0.22018348623853215,4.8632218844984795E-2,1.770833333333333,0.77981651376146788,0.22049286640726326,0,0,0]
[19,28,"LAI MUOI",0.16666666666666669,0,0,0,6.25E-2,0.37499999999999994,7.7821011673151752E-3,0.10416666666666667,0.625,1.8867924528301886E-2]
[20,30,"TAEKWONDO",0.41666666666666669,2.0833333333333332E-2,4.9999999999999996E-2,2.0263424518743665E-3,0.25,0.6,3.1128404669260701E-2,0.14583333333333334,0.35000000000000003,2.6415094339622639E-2]
[21,31,"E.S.A.G.A.M.I",0.5,0,0,0,2.0833333333333332E-2,4.1666666666666664E-2,2.5940337224383916E-3,0.47916666666666663,0.95833333333333326,8.679245283018866E-2]
[22,32,"ALEETT",0.5,6.25E-2,0.125,6.0790273556230994E-3,0.16666666666666666,0.33333333333333331,2.0752269779507133E-2,0.27083333333333331,0.54166666666666663,4.9056603773584895E-2]
[23,34,"SPIRIT 38",0.51041666666666674,6.25E-2,0.12244897959183672,6.0790273556230994E-3,0.10416666666666667,0.2040816326530612,1.2970168612191959E-2,0.34375,0.6734693877551019,6.226415094339622E-2]
[24,35,"GMC38EYBENS",0,0,{"$error":"#DIV/0!"},0,0,{"$error":"#DIV/0!"},0,0,{"$error":"#DIV/0!"},0]
[25,36,"PETANQUE",0.58333333333333337,0.375,0.64285714285714279,3.6474164133738593E-2,4.1666666666666664E-2,7.1428571428571425E-2,5.1880674448767832E-3,0.16666666666666666,0.2857142857142857,3.0188679245283016E-2]
[26,37,"HBC2E",1.2291666666666665,0.125,0.10169491525423729,1.2158054711246199E-2,0.375,0.30508474576271188,4.6692607003891051E-2,0.72916666666666663,0.59322033898305093,0.13207547169811318]
[null,null,"Total Utilisé",null,{"$f":"SUM(E14:E39)","v":10.281250000000002},null,null,{"$f":"SUM(H14:H39)","v":8.03125},null,null,{"$f":"SUM(K14:K39)","v":5.5208333333333339}]

{"sheet":"Feuil1","index":26,"n_rows":0,"n_cols":0,"rows_kept":0,"cut":false,"hidden":false,"merged":[]}